FreshPorts -- The Place For Ports If you buy from Amazon USA, please support us by using this link.
Follow us
Blog
Twitter

Search FreshPorts using Google
not searching src

The FreshPorts Search


Include deleted ports Case sensitive search Sort by:
Include /src tree

Notes

  • Case sensitivity is ignored for "sounds like" and output is ordered by the soundex.
  • When searching on 'Message ID', the type of match is ignored.
  • When searching on 'Commit Message' only 'containing' is used.
  • When searching by 'Under a pathname', your path must start with something like /ports/, /doc/, or /src/. All commits under that point will be returned. The selected match type is ignored and defaults to 'Starts with'.
Number of commits: 37
Sat, 4 Jun 2016
[ 16:25 dim ] Original commit 
libcxxrt 20160529 devel files touched by this commit Implementation of the Code Sourcery C++ ABI
Update devel/libcxxrt to the latest upstream version, as of 2016-05-29.

All previous patches have been dropped, since these have all been merged
upsream.

Approved by:	mokhi64@gmail.com (maintainer)
PR:		209937
Mon, 23 May 2016
[ 16:25 dim ] Original commit 
wxgtk30 3.0.2_4 x11-toolkits files touched by this commit The wxWidgets GUI toolkit with GTK+ bindings
During the exp-run in bug 208158, it was found that x11-toolkits/wxgtk30
gives errors with libc++ 3.8.0:

./src/stc/scintilla/src/Editor.cxx:5844:6: error: call to 'abs' is ambiguous
        if (abs(pt1.x - pt2.x) > 3)
            ^~~

This is because pt1.x and pt2.x are float values, but <cmath> is not
included, and abs() for float values comes from that header.  Fix it by
including <cmath>.

Approved by:	portmaster@bsdforge.com (maintainer)
Approved by:	vlad-fbsd@acheronmedia.com (maintainer)
PR:		209694
MFH:		2016Q2
Sun, 8 May 2016
[ 12:05 dim ] Original commit 
easystroke 0.6.0_3 deskutils files touched by this commit Easystroke is a gesture-recognition application for X11
During the exp-run in bug 208158, it was found that deskutils/easystroke
gives errors with libc++ 3.8.0:

handler.cc:536:21: error: static declaration of 'abs' follows non-static
declaration
static inline float abs(float x) { return x > 0 ? x : -x; }
                    ^
/usr/include/c++/v1/math.h:646:1: note: previous definition is here
abs(float __lcpp_x) _NOEXCEPT {return fabsf(__lcpp_x);}
^

This is because easystroke tries to roll its own version of abs(), which
is already defined in math.h.  Fix this by removing the custom abs().

Approved by:	t@tobik.me (maintainer)
PR:		209372
MFH:		2016Q2
Sat, 7 May 2016
[ 22:44 dim ] Original commit 
sunpinyin 2.0.4.r3_1 chinese files touched by this commit Statistical language model based input method engine
During the exp-run in bug 208158, it was found that chinese/sunpinyin
gives errors with libc++ 3.8.0:

gmake[2]: Entering directory '/wrkdirs/usr/ports/chinese/sunpinyin/work'
slmpack lm_sc.3gm.arpa dict.utf8 lm_sc.3gm
Loading lexicon...done.
Loading ARPA slm...
Writing out...done!
slmthread lm_sc.3gm lm_sc.t3g.orig
Loading original slm...
first pass...
Compressing pr values...65536 float values ==> 65536 values
Compressing bow values...16384 float values ==> 16384 values
Threading the new model...Assertion failed: (prit != pr_map.end()), function
main, file src/slm/thread/slmthread.cpp, line 364.
/wrkdirs/usr/ports/chinese/sunpinyin/work/sunpinyin-a8bd811/src/sunpinyin-dictgen.mk:51:
recipe for target 'lm_sc.t3g.orig' failed

This is because the code mostly uses floats, but in some parts it uses
log(), exp(), etc, which return doubles.  During the parts where it does
lookups in std::map<float, int> constructs, this leads to it not being
able to find the expected entries.  Fix this by using logf(), expf() and
similar, which explicitly return floats.

Approved by:	lichray@gmail.com (maintainer)
PR:		209369
MFH:		2016Q2
[ 19:38 dim ] Original commit 
ugene 1.22.0_1 biology files touched by this commit Free, open-source, cross-platform bioinformatics toolkit
During the exp-run in bug 208158, it was found that biology/ugene gives
errors with libc++ 3.8.0:

In file included from src/QScoreAdapter.cpp:1:
In file included from src/QScoreAdapter.h:4:
In file included from ../../include/U2Core/MAlignment.h:1:
In file included from
../../include/U2Core/../../corelibs/U2Core/src/datatype/MAlignment.h:25:
In file included from
../../include/U2Core/../../corelibs/U2Core/src/datatype/MAlignmentInfo.h:25:
In file included from /usr/local/include/qt5/QtCore/QString:1:
In file included from /usr/local/include/qt5/QtCore/qstring.h:41:
In file included from /usr/local/include/qt5/QtCore/qchar.h:37:
In file included from /usr/local/include/qt5/QtCore/qglobal.h:39:
/usr/include/c++/v1/cstddef:43:15: fatal error: 'stddef.h' file not found
#include_next <stddef.h>
              ^

This is because the port tries to add /usr/include as a system include
directory, using -isystem, and this screws up the order of include
directories.  Fix it by patching up a number of .pri files to avoid
using the -isystem flag.

Approved by:	h2+fbsdports@fsfe.org (maintainer)
PR:		209366
MFH:		2016Q2
Tue, 26 Apr 2016
[ 18:18 dim ] Original commit 
powerdns 3.4.8_1 dns files touched by this commit Advanced DNS server with multiple backends including SQL
During the exp-run in bug 208158, it was found that dns/powerdns gives
errors with libc++ 3.8.0:

dnspacket.cc:645:6: error: call to 'abs' is ambiguous
  if(abs(trc->d_time - now) > trc->d_fudge) {
     ^~~

This is because abs() is being called with unsigned arguments.  Import
upstream commit f2d05dd to fix it.

Approved by:	tremere@cainites.net
PR:		208725
MFH:		2016Q2
Mon, 25 Apr 2016
[ 20:22 dim ] Original commit 
python27 2.7.11_2 lang files touched by this commit Interpreted object-oriented programming language
python33 3.3.6_4 lang  Deprecated Expiration Date files touched by this commit Interpreted object-oriented programming language
python34 3.4.4_2 lang files touched by this commit Interpreted object-oriented programming language
python35 3.5.1_2 lang files touched by this commit Interpreted object-oriented programming language
For the various lang/python* ports, improve the __FreeBSD_version
check in pyport.h for working around a very old ctype issue.

If the workaround for this issue is enabled, pyport.h redefines
toupper() and some other ctype macros, and this wreaks havoc when
including newer libc++ headers (or any other system header which tries
to declare those functions).

Approved by:	portmgr (antoine)
PR:		208486
MFH:		2016Q2
Sun, 17 Apr 2016
[ 13:43 dim ] Original commit 
cuneiform 1.1.0_4 graphics files touched by this commit OCR system developed and open sourced by Cognitive technologies
During the exp-run in bug 208158, it was found that graphics/cuneiform
gives errors with libc++ 3.8.0:

cuneiform_src/Kern/rimage/sources/main/cricontrol.cpp:597:32: error: call to
'abs' is ambiguous
        wNewHeight = (mbMarginsFlag ? abs(mrMargins.rmBottomMarg -
mrMargins.rmTopMarg) : mpSourceDIB->GetLinesNumber());
                                      ^~~

This is because abs() is being called an unsigned argument.  Fix this by
casting the argument to the appropriate signed type.

Approved by:	samm@os2.kiev.ua (maintainer)
MFH:		2016Q2
Sat, 16 Apr 2016
[ 21:30 dim ] Original commit 
gource 0.43_1 graphics files touched by this commit OpenGL-based 3D visualisation tool for source control repositories
During the exp-run in bug 208158, it was found that graphics/gource
gives errors with libc++ 3.8.0:

src/dirnode.cpp:585:27: error: no matching function for call to 'max'
    this->parent_radius = std::max(1.0, sqrt(total_file_area) *
gGourceDirPadding);
                          ^~~~~~~~

This is because max() is being called with two arguments of different
type (double and float).  Fix this by using 0.0f instead (and casting
the result of sqrt to float like two lines above, though this should
strictly not be necessary).

Approved by:	demon (maintainer)
PR:		208844
MFH:		2016Q2
Fri, 8 Apr 2016
[ 08:42 dim ] Original commit 
mysql57-server 5.7.10_4 databases files touched by this commit Multithreaded SQL database (server)
Fix patches that were accidentally concatenated twice in r412695.

Reported by:	Vladimir Omelchuk <admin@vladiom.com.ua>
Pointy hat to:	dim
PR:		208525
MFH:		2016Q2
Thu, 7 Apr 2016
[ 22:23 dim ] Original commit 
mysql57-server 5.7.10_4 databases files touched by this commit Multithreaded SQL database (server)
In the exp-run for bug 208158, building databases/mysql57-server
resulted in errors with libc++ 3.8.0, because it declares the allocators
for several std::map declarations incorrectly.  Fix this by sprinkling
const in the right places.

Approved by:	mokhi64@gmail.com (maintainer)
PR:		208525
MFH:		2016Q2
Mon, 4 Apr 2016
[ 19:00 dim ] Original commit 
telldus-core 2.1.2_1 comms files touched by this commit Tellstick Telldus daemon + library
During the exp-run in bug 208158, it was found that comms/telldus-core
gives errors with libc++ 3.8.0 [1]:

/wrkdirs/usr/ports/comms/telldus-core/work/telldus-core-2.1.2/service/ProtocolNexa.cpp:59:8:
error: call to member function 'insert' is ambiguous
                        str.insert(0, 1, 2);  // Repeat two times
                        ~~~~^~~~~~

This is because the third argument to this std::string method is
supposed to be a char, not an integer.  Fix it by using '\x2' instead.

[1]
http://package18.nyi.freebsd.org/data/headamd64PR208158-default/2016-03-22_18h30m05s/logs/errors/telldus-core-2.1.2_1.log

Approved by:	johan@stromnet.se (maintainer)
PR:		208523
MFH:		2016Q2
Sat, 2 Apr 2016
[ 15:51 dim ] Original commit 
node 5.9.1 www files touched by this commit V8 JavaScript for client and server (6.x)
During the exp-run in bug 208158, it was found that www/node gives
errors with libc++ 3.8.0 [1]:

/usr/include/c++/v1/map:837:5: error: static_assert failed
"Allocator::value_type must be same type as value_type"
    static_assert((is_same<typename allocator_type::value_type,
value_type>::value),
    ^            
~~~~~~~~~~~~~~~~~~~~~~~~~~~~~~~~~~~~~~~~~~~~~~~~~~~~~~~~~~~~~~~~~
../deps/v8/src/compiler/js-type-feedback.h:41:21: note: in instantiation of
template class 'std::__1::map<unsigned int, v8::internal::TypeFeedbackId,
std::__1::less<unsigned int>,
v8::internal::zone_allocator<v8::internal::TypeFeedbackId> >' requested here
  TypeFeedbackIdMap type_feedback_id_map_;
                    ^

This is because libc++ 3.8.0 has added these sanity checks for custom
std::map allocators, which *must* be of the type std::pair<const Key,
Value>.  I fixed the few std::map instances in the node source by adding
this to their allocator types.

Approved by:	linpct@gmail.com (maintainer)
PR:		208270
MFH:		2016Q2
Number of commits: 37
Login
User Login
Create account

Servers and bandwidth provided by
New York Internet, SuperNews, and RootBSD

This site
What is FreshPorts?
About the authors
Issues
FAQ
How big is it?
The latest upgrade!
Privacy
Forums
Blog
Contact

Search
Enter Keywords:
 
more...

Latest Vulnerabilities
tomcat7Jun 26
tomcat8Jun 26
php55Jun 25
php55-gdJun 25
php55-mbstringJun 25
php55-wddxJun 25
php55-zipJun 25
php56Jun 25
php56-gdJun 25
php56-mbstringJun 25
php56-pharJun 25
php56-wddxJun 25
php56-zipJun 25
php70Jun 25
php70-gdJun 25

17 vulnerabilities affecting 44 ports have been reported in the past 14 days

* - modified, not new

All vulnerabilities


Ports
Home
Categories
Deleted ports
Sanity Test Failures
Newsfeeds

Statistics
Graphs
NEW Graphs (Javascript)
Traffic

Calculated hourly:
Port count 26149
Broken 280
Deprecated 284
Ignore 546
Forbidden 0
Restricted 202
No CDROM 85
Vulnerable 58
Expired 14
Set to expire 271
Interactive 0
new 24 hours 0
new 48 hours3
new 7 days28
new fortnight51
new month105

Servers and bandwidth provided by
New York Internet, SuperNews, and RootBSD
Valid HTML, CSS, and RSS.
Copyright © 2000-2014 Dan Langille. All rights reserved.