notbugIf you buy from Amazon USA, please support us by using this link.
Search FreshPorts using Google
not searching src

The FreshPorts Search


Include deleted ports Case sensitive search Sort by:
Include /src tree
Output format:
HTML
Plain Text
Maximum Effort Minimal output
Branch:

Notes

  • Case sensitivity is ignored for "sounds like" and output is ordered by the soundex.
  • When searching on 'Message ID', the type of match is ignored.
  • When searching on 'Commit Message' only 'containing' is used.
  • When searching by 'Under a pathname', your path must start with something like /ports/, /doc/, or /src/. All commits under that point will be returned. The selected match type is ignored and defaults to 'Starts with'.
  • Searching for 'sounds like' is only valid for Committer, Maintainer, Package Name, and Port Name.
Number of commits: 5671 (showing only 100 on this page) 1 | 2 | 3 | 4 | 5 | 6 | 7 | 8 | 9 | 10 | 11  »  [57]
Sun, 11 Nov 2018
[ 09:08 antoine ] Original commit 
pinentry 1.1.0_2 security files touched by this commit Collection of simple PIN or passphrase entry dialogs
Remove orphan after INFO_PATH move
[ 08:48 antoine ] Original commit 
powerpc64-gcc 6.4.0_2 devel files touched by this commit Cross GNU Compiler Collection for powerpc64
Remove orphans after INFO_PATH move
[ 08:05 antoine ] Original commit 
binutils 2.30_5,1 devel files touched by this commit GNU binary tools
Remove an orphaned directory after INFO_PATH move
Fri, 9 Nov 2018
[ 22:52 antoine ] Original commit 
mosquitto 1.5.3_1 net new! files touched by this commit Open-Source MQTT Broker
MFH: r481153 r483677

- Update to 1.5.3

PR:		231047
Submitted by:	Iblis Lin <iblis@hs.ntnu.edu.tw>
Approved by:	joe@thrallingpenguin.com (maintainer)

net/mosquitto: Fix OpenSSL build

PR:		232168
Submitted by:	Nathan <ndowens@yahoo.com>
Approved by:	joe@thrallingpenguin.com (maintainer)
[ 22:49 antoine ] Original commit 
sysadm 1.1 sysutils new! files touched by this commit SysAdm API server
sysadm-client 1.1 sysutils new! files touched by this commit SysAdm Qt5 Client
MFH: r484224

Update both sysutils/sysadm and sysutils/sysadm-client to version 1.1
[ 22:46 antoine ] Original commit 
libmsocket 0.4_5 devel new! files touched by this commit Socket abstraction library for C programmers
MFH: r484260

Fix build for 12 with opendssl 1.1.0+

Regenerate patches with makepatch
Add license

Reported by:	pkg-fallout
[ 13:19 antoine ] Original commit 
mod_auth_pubtkt 0.13 www new! files touched by this commit Apache module to provide public key ticket based authentication
MFH: r483747

www/mod_auth_pubtkt: update to 0.13

PR:		232894
Submitted by:	mk@neon1.net (maintainer)
[ 11:48 antoine ] Original commit 
rssroll 0.6.2 www new! files touched by this commit RSS collector in C
MFH: r481903 r483542

www/rssroll: Update to 0.6.1

PR:		230691
Submitted by:	Nikola Kolev <koue@chaosophia.net>

www/rssroll: update to 0.6.2

PR:		232806
Submitted by:	Nikola Kolev <koue@chaosophia.net> (maintainer)
Thu, 8 Nov 2018
[ 19:37 antoine ] Original commit 
websocat 1.2.0 www files touched by this commit WebSockets tools
MFH: r483736

Update to recent version 1.2.0, it supports OpenSSL 1.1.1 now.
[ 15:29 antoine ] Original commit 
vtk5 5.10.1_7 math new! Broken Deprecated Expiration Date Ignore files touched by this commit The Visualization Toolkit
MFH: r483941

Mark BROKEN: fails to build

/wrkdirs/usr/ports/math/vtk5/work/VTK5.10.1/Common/vtkOStreamWrapper.cxx:60:1:
error: invalid operands to binary expression ('std::__1::ostream' (aka
'basic_ostream<char>') and 'std::__1::ostream')
VTKOSTREAM_OPERATOR(ostream&);
^~~~~~~~~~~~~~~~~~~~~~~~~~~~~

Reported by:	pkg-fallout
Sun, 4 Nov 2018
[ 22:56 antoine ] Original commit 
npm 6.4.1_1 www files touched by this commit Node package manager
Fix DEPENDS
[ 16:12 antoine ] Original commit 
swift 3.1.1_7 lang new! Broken Ignore files touched by this commit Swift programing language
MFH: r484106

Mark BROKEN: fails to build

In file included from
/wrkdirs/usr/ports/lang/swift/work/swift-3.1.1/swift/lib/SILGen/SILGenProfiling.cpp:13:
In file included from
/wrkdirs/usr/ports/lang/swift/work/swift-3.1.1/swift/lib/SILGen/SILGenProfiling.h:16:
In file included from
/wrkdirs/usr/ports/lang/swift/work/swift-3.1.1/llvm/include/llvm/ADT/DenseMap.h:17:
In file included from
/wrkdirs/usr/ports/lang/swift/work/swift-3.1.1/llvm/include/llvm/ADT/DenseMapInfo.h:17:
In file included from
/wrkdirs/usr/ports/lang/swift/work/swift-3.1.1/llvm/include/llvm/ADT/ArrayRef.h:13:
In file included from
/wrkdirs/usr/ports/lang/swift/work/swift-3.1.1/llvm/include/llvm/ADT/Hashing.h:48:
In file included from
/wrkdirs/usr/ports/lang/swift/work/swift-3.1.1/build/Ninja-ReleaseAssert+stdlib-Release/llvm-freebsd-x86_64/include/llvm/Support/DataTypes.h:33:
In file included from /usr/include/c++/v1/cmath:305:
In file included from /usr/include/c++/v1/math.h:309:
/usr/include/c++/v1/type_traits:1366:38: error: incomplete type 'swift::Expr'
used in type trait expression
    : public integral_constant<bool, __is_abstract(_Tp)> {};
                                     ^

Reported by:	pkg-fallout
[ 16:11 antoine ] Original commit 
swift 3.1.1_8 lang  Broken Ignore files touched by this commit Swift programing language
Mark BROKEN: fails to build

In file included from
/wrkdirs/usr/ports/lang/swift/work/swift-3.1.1/swift/lib/SILGen/SILGenProfiling.cpp:13:
In file included from
/wrkdirs/usr/ports/lang/swift/work/swift-3.1.1/swift/lib/SILGen/SILGenProfiling.h:16:
In file included from
/wrkdirs/usr/ports/lang/swift/work/swift-3.1.1/llvm/include/llvm/ADT/DenseMap.h:17:
In file included from
/wrkdirs/usr/ports/lang/swift/work/swift-3.1.1/llvm/include/llvm/ADT/DenseMapInfo.h:17:
In file included from
/wrkdirs/usr/ports/lang/swift/work/swift-3.1.1/llvm/include/llvm/ADT/ArrayRef.h:13:
In file included from
/wrkdirs/usr/ports/lang/swift/work/swift-3.1.1/llvm/include/llvm/ADT/Hashing.h:48:
In file included from
/wrkdirs/usr/ports/lang/swift/work/swift-3.1.1/build/Ninja-ReleaseAssert+stdlib-Release/llvm-freebsd-x86_64/include/llvm/Support/DataTypes.h:33:
In file included from /usr/include/c++/v1/cmath:305:
In file included from /usr/include/c++/v1/math.h:309:
/usr/include/c++/v1/type_traits:1366:38: error: incomplete type 'swift::Expr'
used in type trait expression
    : public integral_constant<bool, __is_abstract(_Tp)> {};
                                     ^

Reported by:	pkg-fallout
[ 16:10 antoine ] Original commit 
voxelands 1604.00_3 games new! Broken Ignore files touched by this commit Fun-Focused voxel world game
MFH: r484104

Mark BROKEN: fails to build

In file included from src/porting.cpp:33:
In file included from src/config.h:10:
src/cmake_config.h:17:26: error: invalid suffix on literal; C++11 requires a
space between literal and identifier [-Wreserved-user-defined-literal]
#define BUILD_INFO "VER="VERSION_STRING" RUN_IN_PLACE=0 USE_GETTEXT=1
INSTALL_PREFIX=/usr/local BUILD_TYPE="BUILD_TYPE
                         ^

Reported by:	pkg-fallout
[ 16:09 antoine ] Original commit 
voxelands 1604.00_3 games  Broken Ignore files touched by this commit Fun-Focused voxel world game
Mark BROKEN: fails to build

In file included from src/porting.cpp:33:
In file included from src/config.h:10:
src/cmake_config.h:17:26: error: invalid suffix on literal; C++11 requires a
space between literal and identifier [-Wreserved-user-defined-literal]
#define BUILD_INFO "VER="VERSION_STRING" RUN_IN_PLACE=0 USE_GETTEXT=1
INSTALL_PREFIX=/usr/local BUILD_TYPE="BUILD_TYPE
                         ^

Reported by:	pkg-fallout
[ 16:07 antoine ] Original commit 
visualboyadvance-m 2.0.0b2_5 emulators new! Broken Ignore files touched by this commit Game Boy Advance emulator with GTK frontend
MFH: r484102

Mark BROKEN: fails to build

src/gba/Cheats.cpp:2480:5: error: non-constant-expression cannot be narrowed
from type 'unsigned int' to 'u8' (aka 'unsigned char') in initializer list
[-Wc++11-narrowing]
    address & 255,
    ^~~~~~~~~~~~~

Reported by:	pkg-fallout
[ 16:07 antoine ] Original commit 
visualboyadvance-m 2.0.0b2_5 emulators  Broken Ignore files touched by this commit Game Boy Advance emulator with GTK frontend
Mark BROKEN: fails to build

src/gba/Cheats.cpp:2480:5: error: non-constant-expression cannot be narrowed
from type 'unsigned int' to 'u8' (aka 'unsigned char') in initializer list
[-Wc++11-narrowing]
    address & 255,
    ^~~~~~~~~~~~~

Reported by:	pkg-fallout
[ 14:51 antoine ] Original commit 
vidalia 0.2.21 net-mgmt new! Broken Deprecated Expiration Date Ignore files touched by this commit Graphical Tor controller based on Qt 4.x
MFH: r484098

Mark BROKEN too
[ 14:50 antoine ] Original commit 
vidalia 0.2.21 net-mgmt  Broken Deprecated Expiration Date Ignore files touched by this commit Graphical Tor controller based on Qt 4.x
Mark BROKEN too
[ 14:49 antoine ] Original commit 
vba 1.7.2_13 emulators new! Broken Ignore files touched by this commit Open source Gameboy Advance emulator
MFH: r484096

Mark BROKEN: fails to build

../Cheats.cpp:1347:5: error: non-constant-expression cannot be narrowed from
type 'unsigned int' to 'u8' (aka 'unsigned char') in initializer list
[-Wc++11-narrowing]
    address & 255,
    ^~~~~~~~~~~~~

Reported by:	pkg-fallout
[ 14:48 antoine ] Original commit 
vba 1.7.2_13 emulators  Broken Ignore files touched by this commit Open source Gameboy Advance emulator
Mark BROKEN: fails to build

../Cheats.cpp:1347:5: error: non-constant-expression cannot be narrowed from
type 'unsigned int' to 'u8' (aka 'unsigned char') in initializer list
[-Wc++11-narrowing]
    address & 255,
    ^~~~~~~~~~~~~

Reported by:	pkg-fallout
[ 14:47 antoine ] Original commit 
tinymux 2.10.1.13 games new! Broken Ignore files touched by this commit Multi-Player FreeForm adventure Program
MFH: r484094

Mark BROKEN: fails to build

funceval2.cpp:541:16: error: comparison between pointer and integer ('int' and
'UTF8 *' (aka 'unsigned char *'))
       || '\0' == newobject_string)
          ~~~~ ^  ~~~~~~~~~~~~~~~~

Reported by:	pkg-fallout
[ 14:46 antoine ] Original commit 
tinymux 2.10.1.13 games  Broken Ignore files touched by this commit Multi-Player FreeForm adventure Program
Mark BROKEN: fails to build

funceval2.cpp:541:16: error: comparison between pointer and integer ('int' and
'UTF8 *' (aka 'unsigned char *'))
       || '\0' == newobject_string)
          ~~~~ ^  ~~~~~~~~~~~~~~~~

Reported by:	pkg-fallout
[ 14:45 antoine ] Original commit 
terminatorx 3.84_8 audio new! Broken Ignore files touched by this commit Realtime audio synthesizer that allows you to "scratch" on audio data
MFH: r484092

Mark BROKEN: fails to build

tX_audiodevice.cc:372:46: error: C-style cast from 'nullptr_t' to
'jack_options_t' (aka 'JackOptions') is not allowed
        if ((client=jack_client_open("terminatorX", (jack_options_t) NULL,
NULL))==0) {
                                                    ^~~~~~~~~~~~~~~~~~~~~

Reported by:	pkg-fallout
[ 14:44 antoine ] Original commit 
terminatorx 3.84_8 audio  Broken Ignore files touched by this commit Realtime audio synthesizer that allows you to "scratch" on audio data
Mark BROKEN: fails to build

tX_audiodevice.cc:372:46: error: C-style cast from 'nullptr_t' to
'jack_options_t' (aka 'JackOptions') is not allowed
        if ((client=jack_client_open("terminatorX", (jack_options_t) NULL,
NULL))==0) {
                                                    ^~~~~~~~~~~~~~~~~~~~~

Reported by:	pkg-fallout
[ 14:43 antoine ] Original commit 
stepmania-devel 5.0.11_6,1 games new! Broken Ignore files touched by this commit Rhythm game simulator
MFH: r484090

Mark BROKEN: fails to build

In file included from
/wrkdirs/usr/ports/games/stepmania-devel/work/stepmania-5.0.11/src/ScreenDebugOverlay.cpp:12:
In file included from
/wrkdirs/usr/ports/games/stepmania-devel/work/stepmania-5.0.11/src/ScreenGameplay.h:10:
In file included from
/wrkdirs/usr/ports/games/stepmania-devel/work/stepmania-5.0.11/src/BeginnerHelper.h:9:
/wrkdirs/usr/ports/games/stepmania-devel/work/stepmania-5.0.11/src/NoteData.h:378:25:
error: 'swap<NoteData>' is missing exception specification
'noexcept(is_nothrow_move_constructible<NoteData>::value &&
is_nothrow_move_assignable<NoteData>::value)'
        template<> inline void swap<NoteData>( NoteData &nd1, NoteData &nd2 ) {
nd1.swap( nd2 ); }
                               ^

Reported by:	pkg-fallout
[ 14:43 antoine ] Original commit 
stepmania-devel 5.0.11_6,1 games  Broken Ignore files touched by this commit Rhythm game simulator
Mark BROKEN: fails to build

In file included from
/wrkdirs/usr/ports/games/stepmania-devel/work/stepmania-5.0.11/src/ScreenDebugOverlay.cpp:12:
In file included from
/wrkdirs/usr/ports/games/stepmania-devel/work/stepmania-5.0.11/src/ScreenGameplay.h:10:
In file included from
/wrkdirs/usr/ports/games/stepmania-devel/work/stepmania-5.0.11/src/BeginnerHelper.h:9:
/wrkdirs/usr/ports/games/stepmania-devel/work/stepmania-5.0.11/src/NoteData.h:378:25:
error: 'swap<NoteData>' is missing exception specification
'noexcept(is_nothrow_move_constructible<NoteData>::value &&
is_nothrow_move_assignable<NoteData>::value)'
        template<> inline void swap<NoteData>( NoteData &nd1, NoteData &nd2 ) {
nd1.swap( nd2 ); }
                               ^

Reported by:	pkg-fallout
[ 14:40 antoine ] Original commit 
sphinxsearch-devel 2.2.1_2,1 textproc new! Broken Ignore files touched by this commit Sphinx Full-Text Search Engine
MFH: r484088

Mark BROKEN: fails to build

In file included from sphinx.cpp:16:
In file included from ./sphinx.h:41:
./sphinxstd.h:267:2: warning: 'register' storage class specifier is deprecated
and incompatible with C++17 [-Wdeprecated-register]
        register DWORD tmp;
        ^~~~~~~~~
./sphinxstd.h:2328:53: error: invalid suffix on literal; C++11 requires a space
between literal and identifier [-Wreserved-user-defined-literal]
                                sError.SetSprintf ( "mmap() failed: %s
(length="INT64_FMT" is over 2GB, impossible on some 32-bit systems)",
                                                                               
^

Reported by:	pkg-fallout
[ 14:40 antoine ] Original commit 
sphinxsearch-devel 2.2.1_2,1 textproc  Broken Ignore files touched by this commit Sphinx Full-Text Search Engine
Mark BROKEN: fails to build

In file included from sphinx.cpp:16:
In file included from ./sphinx.h:41:
./sphinxstd.h:267:2: warning: 'register' storage class specifier is deprecated
and incompatible with C++17 [-Wdeprecated-register]
        register DWORD tmp;
        ^~~~~~~~~
./sphinxstd.h:2328:53: error: invalid suffix on literal; C++11 requires a space
between literal and identifier [-Wreserved-user-defined-literal]
                                sError.SetSprintf ( "mmap() failed: %s
(length="INT64_FMT" is over 2GB, impossible on some 32-bit systems)",
                                                                               
^

Reported by:	pkg-fallout
[ 14:38 antoine ] Original commit 
saaghar 2.5.0_1 misc new! Broken Ignore files touched by this commit Persian poetry software
MFH: r484086

Mark BROKEN: fails to build

In file included from src/saagharwindow.cpp:26:
src/version.h:29:39: error: no matching literal operator for call to
'operator""__TIME__' with arguments of types 'const char *' and 'unsigned long',
and no matching literal operator template
const QString BUILD_TIME = __DATE__" "__TIME__;
                                      ^

Reported by:	pkg-fallout
[ 14:37 antoine ] Original commit 
saaghar 2.5.0_1 misc  Broken Ignore files touched by this commit Persian poetry software
Mark BROKEN: fails to build

In file included from src/saagharwindow.cpp:26:
src/version.h:29:39: error: no matching literal operator for call to
'operator""__TIME__' with arguments of types 'const char *' and 'unsigned long',
and no matching literal operator template
const QString BUILD_TIME = __DATE__" "__TIME__;
                                      ^

Reported by:	pkg-fallout
[ 14:36 antoine ] Original commit 
rsplib 3.0.2_2 net new! Broken Ignore files touched by this commit RSerPool Framework and Example Applications
MFH: r484084

rsplib is BROKEN on i386 and amd64 too

Reported by:	pkg-fallout
[ 14:35 antoine ] Original commit 
rsplib 3.0.2_2 net  Broken Ignore files touched by this commit RSerPool Framework and Example Applications
rsplib is BROKEN on i386 and amd64 too

Reported by:	pkg-fallout
[ 14:33 antoine ] Original commit 
rawstudio 2.0_18 graphics new! Broken Ignore files touched by this commit Open-source program to read and manipulate RAW photo images
MFH: r484082

Mark BROKEN: fails to build

dcraw.cc:3958:19: error: constant expression evaluates to 128 which cannot be
narrowed to type 'signed char' [-Wc++11-narrowing]
    -1,-2,-1,+0,0,0x80, -1,-2,+0,-1,0,0x01, -1,-2,+1,-1,0,0x01,
                  ^~~~

Reported by:	pkg-fallout
[ 14:33 antoine ] Original commit 
rawstudio 2.0_18 graphics  Broken Ignore files touched by this commit Open-source program to read and manipulate RAW photo images
Mark BROKEN: fails to build

dcraw.cc:3958:19: error: constant expression evaluates to 128 which cannot be
narrowed to type 'signed char' [-Wc++11-narrowing]
    -1,-2,-1,+0,0,0x80, -1,-2,+0,-1,0,0x01, -1,-2,+1,-1,0,0x01,
                  ^~~~

Reported by:	pkg-fallout
[ 14:31 antoine ] Original commit 
qtoctave 0.10.1_4 math new! Broken Ignore files touched by this commit Qt 4 frontend for Octave
MFH: r484080

Mark BROKEN: fails to build

qtoctave/src/generate_menu.cpp:282:64: error: cannot initialize return object of
type 'MenuExtCallBack *' with an rvalue of type 'bool'
        if (!file.open(QIODevice::ReadOnly | QIODevice::Text)) return false;
                                                                      ^~~~~

Reported by:	pkg-fallout
[ 14:31 antoine ] Original commit 
qtoctave 0.10.1_4 math files touched by this commit Qt 4 frontend for Octave
Mark BROKEN: fails to build

qtoctave/src/generate_menu.cpp:282:64: error: cannot initialize return object of
type 'MenuExtCallBack *' with an rvalue of type 'bool'
        if (!file.open(QIODevice::ReadOnly | QIODevice::Text)) return false;
                                                                      ^~~~~

Reported by:	pkg-fallout
[ 14:29 antoine ] Original commit 
qslim 2.1_11 graphics new! Broken Ignore files touched by this commit SlimKit surface modeling tools
MFH: r484078

Mark BROKEN: fails to link

c++ -o qslim cmdline.o main.o output.o qslim.o  -L/usr/local/lib -pthread
-fstack-protector  -L/wrkdirs/usr/ports/graphics/qslim/work/qslim-2.1/mixkit/src
-lmix -lgfx -lm
/wrkdirs/usr/ports/graphics/qslim/work/qslim-2.1/mixkit/src/libmix.so: undefined
reference to `gfx::MxGUI::add_toggle_menu(std::__1::basic_string<char,
std::__1::char_traits<char>, std::__1::allocator<char> > const&, int, bool&,
int)'
/wrkdirs/usr/ports/graphics/qslim/work/qslim-2.1/mixkit/src/libmix.so: undefined
reference to `gfx::MxGUI::key_press(int)'
/wrkdirs/usr/ports/graphics/qslim/work/qslim-2.1/mixkit/src/libmix.so: undefined
reference to `gfx::MxGUI::cb_hdtv_size(int)'
/wrkdirs/usr/ports/graphics/qslim/work/qslim-2.1/mixkit/src/libmix.so: undefined
reference to `typeinfo for gfx::MxGUI'
/wrkdirs/usr/ports/graphics/qslim/work/qslim-2.1/mixkit/src/libmix.so: undefined
reference to `gfx::MxGUI::cb_exit()'
/wrkdirs/usr/ports/graphics/qslim/work/qslim-2.1/mixkit/src/libmix.so: undefined
reference to `gfx::MxGUI::current'
/wrkdirs/usr/ports/graphics/qslim/work/qslim-2.1/mixkit/src/libmix.so: undefined
reference to `gfx::MxGUI::initialize(int, char**, Fl_Menu_Item*, int, int)'
/wrkdirs/usr/ports/graphics/qslim/work/qslim-2.1/mixkit/src/libmix.so: undefined
reference to `gfx::MxGUI::cb_load_view_from_file()'
/wrkdirs/usr/ports/graphics/qslim/work/qslim-2.1/mixkit/src/libmix.so: undefined
reference to `gfx::MxGUI::cb_dv_size(int)'
/wrkdirs/usr/ports/graphics/qslim/work/qslim-2.1/mixkit/src/libmix.so: undefined
reference to `gfx::MxGUI::cb_fps()'
(Only the first 15 lines of the commit message are shown above View all of this commit message)
[ 14:29 antoine ] Original commit 
qslim 2.1_11 graphics  Broken Ignore files touched by this commit SlimKit surface modeling tools
Mark BROKEN: fails to link

c++ -o qslim cmdline.o main.o output.o qslim.o  -L/usr/local/lib -pthread
-fstack-protector  -L/wrkdirs/usr/ports/graphics/qslim/work/qslim-2.1/mixkit/src
-lmix -lgfx -lm
/wrkdirs/usr/ports/graphics/qslim/work/qslim-2.1/mixkit/src/libmix.so: undefined
reference to `gfx::MxGUI::add_toggle_menu(std::__1::basic_string<char,
std::__1::char_traits<char>, std::__1::allocator<char> > const&, int, bool&,
int)'
/wrkdirs/usr/ports/graphics/qslim/work/qslim-2.1/mixkit/src/libmix.so: undefined
reference to `gfx::MxGUI::key_press(int)'
/wrkdirs/usr/ports/graphics/qslim/work/qslim-2.1/mixkit/src/libmix.so: undefined
reference to `gfx::MxGUI::cb_hdtv_size(int)'
/wrkdirs/usr/ports/graphics/qslim/work/qslim-2.1/mixkit/src/libmix.so: undefined
reference to `typeinfo for gfx::MxGUI'
/wrkdirs/usr/ports/graphics/qslim/work/qslim-2.1/mixkit/src/libmix.so: undefined
reference to `gfx::MxGUI::cb_exit()'
/wrkdirs/usr/ports/graphics/qslim/work/qslim-2.1/mixkit/src/libmix.so: undefined
reference to `gfx::MxGUI::current'
/wrkdirs/usr/ports/graphics/qslim/work/qslim-2.1/mixkit/src/libmix.so: undefined
reference to `gfx::MxGUI::initialize(int, char**, Fl_Menu_Item*, int, int)'
/wrkdirs/usr/ports/graphics/qslim/work/qslim-2.1/mixkit/src/libmix.so: undefined
reference to `gfx::MxGUI::cb_load_view_from_file()'
/wrkdirs/usr/ports/graphics/qslim/work/qslim-2.1/mixkit/src/libmix.so: undefined
reference to `gfx::MxGUI::cb_dv_size(int)'
/wrkdirs/usr/ports/graphics/qslim/work/qslim-2.1/mixkit/src/libmix.so: undefined
reference to `gfx::MxGUI::cb_fps()'
/wrkdirs/usr/ports/graphics/qslim/work/qslim-2.1/mixkit/src/libmix.so: undefined
reference to `gfx::MxGUI::cb_new()'
/wrkdirs/usr/ports/graphics/qslim/work/qslim-2.1/mixkit/src/libmix.so: undefined
reference to `gfx::MxGUI::update_animation()'
(Only the first 15 lines of the commit message are shown above View all of this commit message)
[ 14:27 antoine ] Original commit 
qore 0.8.12_1 lang new! Broken Ignore files touched by this commit Qore Programming Language
MFH: r484075

qore is BROKEN on i386 and amd64 too
[ 14:26 antoine ] Original commit 
qore 0.8.12_1 lang  Broken Ignore files touched by this commit Qore Programming Language
qore is BROKEN on i386 and amd64 too
[ 14:25 antoine ] Original commit 
qlandkartegt 1.8.1_1 astro new! Broken Ignore files touched by this commit The ultimate outdoor aficionado's tool
MFH: r484073

Mark BROKEN: fails to build

3rdparty/map2gcm/main.cpp:396:36: error: no matching literal operator for call
to 'operator""_MKSTR' with arguments of types 'const char *' and 'unsigned
long', and no matching literal operator template
    printf("\n****** %s ******\n", WHAT_STR);
                                   ^

Reported by:	pkg-fallout
[ 14:24 antoine ] Original commit 
qlandkartegt 1.8.1_1 astro  Broken Ignore files touched by this commit The ultimate outdoor aficionado's tool
Mark BROKEN: fails to build

3rdparty/map2gcm/main.cpp:396:36: error: no matching literal operator for call
to 'operator""_MKSTR' with arguments of types 'const char *' and 'unsigned
long', and no matching literal operator template
    printf("\n****** %s ******\n", WHAT_STR);
                                   ^

Reported by:	pkg-fallout
[ 14:22 antoine ] Original commit 
qbrew 0.4.1_4 misc new! Broken Ignore files touched by this commit Homebrewer's recipe calculator
MFH: r484071

Mark BROKEN: fails to build

src/beerxmlreader.cpp:257:16: error: no viable conversion from returned value of
type 'bool' to function return type 'Recipe'
        return false;
               ^~~~~

Reported by:	pkg-fallout
[ 14:22 antoine ] Original commit 
qbrew 0.4.1_4 misc  Broken Ignore files touched by this commit Homebrewer's recipe calculator
Mark BROKEN: fails to build

src/beerxmlreader.cpp:257:16: error: no viable conversion from returned value of
type 'bool' to function return type 'Recipe'
        return false;
               ^~~~~

Reported by:	pkg-fallout
[ 14:20 antoine ] Original commit 
pykawari 8.2.8_8 games new! Broken Ignore files touched by this commit Real kawari8 module for ninix-aya
MFH: r484069

Mark BROKEN: fails to build

shiori/kawari_shiori.cpp:147:35: error: invalid suffix on literal; C++11
requires a space between literal and identifier
[-Wreserved-user-defined-literal]
                        response.SetStartline("SHIORI/"SHIORIVER" 500 Internal
Server Error");
                                                       ^

Reported by:	pkg-fallout
[ 14:19 antoine ] Original commit 
pykawari 8.2.8_8 games  Broken Ignore files touched by this commit Real kawari8 module for ninix-aya
Mark BROKEN: fails to build

shiori/kawari_shiori.cpp:147:35: error: invalid suffix on literal; C++11
requires a space between literal and identifier
[-Wreserved-user-defined-literal]
                        response.SetStartline("SHIORI/"SHIORIVER" 500 Internal
Server Error");
                                                       ^

Reported by:	pkg-fallout
[ 14:17 antoine ] Original commit 
paintown 3.6.0_7 games new! Broken Ignore files touched by this commit Fighting game similar to Streets of Rage and TMNT
MFH: r484067

Mark BROKEN: fails to build

In file included from build/sdl/util/init.cpp:38:
build/sdl/util/dumb/include/dumb.h:41:27: error: invalid suffix on literal;
C++11 requires a space between literal and identifier
[-Wreserved-user-defined-literal]
#define DUMB_NAME "DUMB v"DUMB_VERSION_STR
                          ^

Reported by:	pkg-fallout
[ 14:17 antoine ] Original commit 
paintown 3.6.0_7 games  Broken Ignore files touched by this commit Fighting game similar to Streets of Rage and TMNT
Mark BROKEN: fails to build

In file included from build/sdl/util/init.cpp:38:
build/sdl/util/dumb/include/dumb.h:41:27: error: invalid suffix on literal;
C++11 requires a space between literal and identifier
[-Wreserved-user-defined-literal]
#define DUMB_NAME "DUMB v"DUMB_VERSION_STR
                          ^

Reported by:	pkg-fallout
[ 14:15 antoine ] Original commit 
mosesdecoder 2.1.1_13 math new! Broken Ignore files touched by this commit Statistical machine translation system
MFH: r484065

Mark BROKEN: fails to build

In file included from moses/LM/Rand.cpp:37:
In file included from /usr/local/include/RandLM/RandLM.h:23:
/usr/local/include/RandLM/RandLMQuantiser.h:41:24: error: in-class initializer
for static data member of type 'const float' requires 'constexpr' specifier
[-Wstatic-float-init]
    static const float kFloatErr = 0.00001f;
                       ^           ~~~~~~~~

Reported by:	pkg-fallout
[ 14:14 antoine ] Original commit 
mosesdecoder 2.1.1_13 math  Broken Ignore files touched by this commit Statistical machine translation system
Mark BROKEN: fails to build

In file included from moses/LM/Rand.cpp:37:
In file included from /usr/local/include/RandLM/RandLM.h:23:
/usr/local/include/RandLM/RandLMQuantiser.h:41:24: error: in-class initializer
for static data member of type 'const float' requires 'constexpr' specifier
[-Wstatic-float-init]
    static const float kFloatErr = 0.00001f;
                       ^           ~~~~~~~~

Reported by:	pkg-fallout
[ 14:12 antoine ] Original commit 
metisse 0.4.1_9 x11 new! Broken Ignore files touched by this commit Innovative X-based window system
MFH: r484063

Mark BROKEN: fails to build

MetisseDesktop.cxx:1111:2: error: no matching constructor for initialization of
'MetisseDesktop'
        MetisseDesktop(rfburi, "foldable", false, false);
        ^              ~~~~~~~~~~~~~~~~~~~~~~~~~~~~~~~~

Reported by:	pkg-fallout
[ 14:12 antoine ] Original commit 
metisse 0.4.1_9 x11  Broken Ignore files touched by this commit Innovative X-based window system
Mark BROKEN: fails to build

MetisseDesktop.cxx:1111:2: error: no matching constructor for initialization of
'MetisseDesktop'
        MetisseDesktop(rfburi, "foldable", false, false);
        ^              ~~~~~~~~~~~~~~~~~~~~~~~~~~~~~~~~

Reported by:	pkg-fallout
[ 14:10 antoine ] Original commit 
mdcp 0.1.2.2 sysutils new! Broken Ignore files touched by this commit Fastest utility for copy from a disk device for many
MFH: r484061

Mark BROKEN: fails to build

mdcp.cc:359:3: error: no matching function for call to 'clock_gettime'
  clock_gettime( NULL, &timeStarted );
  ^~~~~~~~~~~~~

Reported by:	pkg-fallout
[ 14:10 antoine ] Original commit 
mdcp 0.1.2.2 sysutils  Broken Ignore files touched by this commit Fastest utility for copy from a disk device for many
Mark BROKEN: fails to build

mdcp.cc:359:3: error: no matching function for call to 'clock_gettime'
  clock_gettime( NULL, &timeStarted );
  ^~~~~~~~~~~~~

Reported by:	pkg-fallout
[ 14:08 antoine ] Original commit 
mandelbulber 1.13.1_1 graphics new! Broken Ignore files touched by this commit 3D Mandelbrot fractal renderer
MFH: r484059

Mark BROKEN: fails to build

../src/Render3D.cpp:870:30: error: type 'double' cannot be narrowed to 'unsigned
short' in initializer list [-Wc++11-narrowing]
                                                sRGB16 globalLight = { AO.R *
4096.0, AO.G * 4096.0, AO.B * 4096.0 };
                                                                      
^~~~~~~~~~~~~

Reported by:	pkg-fallout
[ 14:08 antoine ] Original commit 
mandelbulber 1.13.1_1 graphics  Broken Ignore files touched by this commit 3D Mandelbrot fractal renderer
Mark BROKEN: fails to build

../src/Render3D.cpp:870:30: error: type 'double' cannot be narrowed to 'unsigned
short' in initializer list [-Wc++11-narrowing]
                                                sRGB16 globalLight = { AO.R *
4096.0, AO.G * 4096.0, AO.B * 4096.0 };
                                                                      
^~~~~~~~~~~~~

Reported by:	pkg-fallout
[ 14:04 antoine ] Original commit 
kcheckers 0.8.1_1 games new! Broken Ignore files touched by this commit Qt version of the classic boardgame checkers
MFH: r484057

Mark BROKEN: fails to build

pdn.cc:350:27: error: invalid suffix on literal; C++11 requires a space between
literal and identifier [-Wreserved-user-defined-literal]
        if(!parse_moves(moves+" "END_OF_MOVELINE)) {            // :)
                                 ^

Reported by:	pkg-fallout
[ 14:04 antoine ] Original commit 
kcheckers 0.8.1_1 games  Broken Ignore files touched by this commit Qt version of the classic boardgame checkers
Mark BROKEN: fails to build

pdn.cc:350:27: error: invalid suffix on literal; C++11 requires a space between
literal and identifier [-Wreserved-user-defined-literal]
        if(!parse_moves(moves+" "END_OF_MOVELINE)) {            // :)
                                 ^

Reported by:	pkg-fallout
[ 14:02 antoine ] Original commit 
he2 0.61_3 hebrew new! Broken Ignore files touched by this commit Editor for editing (primarily LaTeX) Hebrew files
MFH: r484055

Mark BROKEN: fails to build

LineEdit.cxx:90:28: error: non-constant-expression cannot be narrowed from type
'size_t' (aka 'unsigned long') to 'int' in initializer list [-Wc++11-narrowing]
       Marker location={1, strlen(str), -1} ;
                           ^~~~~~~~~~~

Reported by:	pkg-fallout
[ 14:01 antoine ] Original commit 
he2 0.61_3 hebrew  Broken Ignore files touched by this commit Editor for editing (primarily LaTeX) Hebrew files
Mark BROKEN: fails to build

LineEdit.cxx:90:28: error: non-constant-expression cannot be narrowed from type
'size_t' (aka 'unsigned long') to 'int' in initializer list [-Wc++11-narrowing]
       Marker location={1, strlen(str), -1} ;
                           ^~~~~~~~~~~

Reported by:	pkg-fallout
[ 13:59 antoine ] Original commit 
inventor 2.1.5.p10_14 graphics new! Broken Ignore files touched by this commit SGI's Open Inventor (TM)
MFH: r484052

Mark BROKEN: fails to build

SoText2.c++:892:14: error: cast from pointer to smaller type 'char' loses
information
       *s1 = (char)NULL;  /* font name is pointed to s */
             ^~~~~~~~~~

Reported by:	pkg-fallout
[ 13:59 antoine ] Original commit 
inventor 2.1.5.p10_14 graphics  Broken Ignore files touched by this commit SGI's Open Inventor (TM)
Mark BROKEN: fails to build

SoText2.c++:892:14: error: cast from pointer to smaller type 'char' loses
information
       *s1 = (char)NULL;  /* font name is pointed to s */
             ^~~~~~~~~~

Reported by:	pkg-fallout
[ 13:56 antoine ] Original commit 
goblin 2.8.b30_1 math new! Broken Ignore files touched by this commit Graph Object Library for Network Programming Problems
MFH: r484050

Mark BROKEN: fails to build

In file included from shell_src/goshGraph.cpp:13:
In file included from include/gosh.h:13:
In file included from include/goblin.h:21:
In file included from include/managedObject.h:17:
In file included from include/attributePool.h:19:
include/fileImport.h:46:5: error: exception specification of overriding function
is more lax than base version
    ~goblinImport() throw(ERParse);
    ^

Reported by:	pkg-fallout
[ 13:55 antoine ] Original commit 
goblin 2.8.b30_1 math  Broken Ignore files touched by this commit Graph Object Library for Network Programming Problems
Mark BROKEN: fails to build

In file included from shell_src/goshGraph.cpp:13:
In file included from include/gosh.h:13:
In file included from include/goblin.h:21:
In file included from include/managedObject.h:17:
In file included from include/attributePool.h:19:
include/fileImport.h:46:5: error: exception specification of overriding function
is more lax than base version
    ~goblinImport() throw(ERParse);
    ^

Reported by:	pkg-fallout
[ 13:54 antoine ] Original commit 
fs-uae 2.4.1_5 emulators new! Broken Ignore files touched by this commit Amiga emulator
MFH: r484048

Mark BROKEN: fails to build

src/blkdev.cpp:664:40: error: non-constant-expression cannot be narrowed from
type 'int' to 'uae_u8' (aka 'unsigned char') in initializer list
[-Wc++11-narrowing]
                uae_u8 cmd[10] = {0x4b,0,0,0,0,0,0,0,paused?0:1,0};
                                                     ^~~~~~~~~~

Reported by:	pkg-fallout
[ 13:54 antoine ] Original commit 
fs-uae 2.4.1_5 emulators  Broken Ignore files touched by this commit Amiga emulator
Mark BROKEN: fails to build

src/blkdev.cpp:664:40: error: non-constant-expression cannot be narrowed from
type 'int' to 'uae_u8' (aka 'unsigned char') in initializer list
[-Wc++11-narrowing]
                uae_u8 cmd[10] = {0x4b,0,0,0,0,0,0,0,paused?0:1,0};
                                                     ^~~~~~~~~~

Reported by:	pkg-fallout
[ 13:52 antoine ] Original commit 
frobtads 1.2.3_1 games new! Broken Ignore files touched by this commit TADS interpreter and the compilers for both TADS 2 and 3
MFH: r484046

Mark BROKEN: fails to build

tads3/tct3stm.cpp:318:21: error: comparison between pointer and integer
('CTcPrsNode *' and 'int')
    if (create_iter != VM_INVALID_PROP)
        ~~~~~~~~~~~ ^  ~~~~~~~~~~~~~~~

Reported by:	pkg-fallout
[ 13:51 antoine ] Original commit 
frobtads 1.2.3_1 games  Broken Ignore files touched by this commit TADS interpreter and the compilers for both TADS 2 and 3
Mark BROKEN: fails to build

tads3/tct3stm.cpp:318:21: error: comparison between pointer and integer
('CTcPrsNode *' and 'int')
    if (create_iter != VM_INVALID_PROP)
        ~~~~~~~~~~~ ^  ~~~~~~~~~~~~~~~

Reported by:	pkg-fallout
[ 13:49 antoine ] Original commit 
ede 2.1_3 x11-wm new! Broken Ignore files touched by this commit Equinox Desktop Environment
MFH: r484044

Mark BROKEN: fails to build

evoke/Xsm.cpp:653:17: error: invalid suffix on literal; C++11 requires a space
between literal and identifier [-Wreserved-user-defined-literal]
        file += "/ede/"SETTINGS_FILENAME".conf";
                       ^

Reported by:	pkg-fallout
[ 13:49 antoine ] Original commit 
ede 2.1_3 x11-wm  Broken Ignore files touched by this commit Equinox Desktop Environment
Mark BROKEN: fails to build

evoke/Xsm.cpp:653:17: error: invalid suffix on literal; C++11 requires a space
between literal and identifier [-Wreserved-user-defined-literal]
        file += "/ede/"SETTINGS_FILENAME".conf";
                       ^

Reported by:	pkg-fallout
[ 13:47 antoine ] Original commit 
drcreep 1.1,1 games new! Broken Ignore files touched by this commit Castles of Dr. Creep
MFH: r484042

Mark BROKEN: fails to build

src/stdafx.cpp:215:56: error: invalid operands to binary expression
('std::__1::basic_istream<char>' and 'int')
                if(fileStream->read( (char*) fileBuffer, pFileSize ) == 0) {
                   ~~~~~~~~~~~~~~~~~~~~~~~~~~~~~~~~~~~~~~~~~~~~~~~~~ ^  ~

Reported by:	pkg-fallout
[ 13:46 antoine ] Original commit 
drcreep 1.1,1 games  Broken Ignore files touched by this commit Castles of Dr. Creep
Mark BROKEN: fails to build

src/stdafx.cpp:215:56: error: invalid operands to binary expression
('std::__1::basic_istream<char>' and 'int')
                if(fileStream->read( (char*) fileBuffer, pFileSize ) == 0) {
                   ~~~~~~~~~~~~~~~~~~~~~~~~~~~~~~~~~~~~~~~~~~~~~~~~~ ^  ~

Reported by:	pkg-fallout
[ 13:45 antoine ] Original commit 
dmd2 2.073.2 lang new! Broken Ignore files touched by this commit D 2.0 compiler, not officially validated for FreeBSD
MFH: r484039

Mark BROKEN: fails to build

backend/go.c:80:11: error: constant expression evaluates to -1 which cannot be
narrowed to type 'mftype' (aka 'unsigned int') [-Wc++11-narrowing]
    {   0,MFall,MFcnp,MFcp,MFcse,MFda,MFdc,MFdv,MFli,MFliv,MFlocal,MFloop,
          ^~~~~

Reported by:	pkg-fallout
[ 13:44 antoine ] Original commit 
dmd2 2.073.2 lang  Broken Ignore files touched by this commit D 2.0 compiler, not officially validated for FreeBSD
Mark BROKEN: fails to build

backend/go.c:80:11: error: constant expression evaluates to -1 which cannot be
narrowed to type 'mftype' (aka 'unsigned int') [-Wc++11-narrowing]
    {   0,MFall,MFcnp,MFcp,MFcse,MFda,MFdc,MFdv,MFli,MFliv,MFlocal,MFloop,
          ^~~~~

Reported by:	pkg-fallout
[ 13:40 antoine ] Original commit 
desmume 0.9.11_2 emulators new! Broken Ignore files touched by this commit Nintendo DS emulator
MFH: r484037

Mark BROKEN: fails to build

In file included from firmware.cpp:22:
./path.h:378:33: error: cannot initialize an array element of type 'char' with
an rvalue of type 'nullptr_t'
                                        char format[] = { '%', *p, NULL };
                                                                   ^~~~

Reported by:	pkg-fallout
[ 13:40 antoine ] Original commit 
desmume 0.9.11_2 emulators  Broken Ignore files touched by this commit Nintendo DS emulator
Mark BROKEN: fails to build

In file included from firmware.cpp:22:
./path.h:378:33: error: cannot initialize an array element of type 'char' with
an rvalue of type 'nullptr_t'
                                        char format[] = { '%', *p, NULL };
                                                                   ^~~~

Reported by:	pkg-fallout
[ 13:36 antoine ] Original commit 
d2x-xl 1.14.121_10 games new! Broken Ignore files touched by this commit Community Unix port of Descent 2 Game
MFH: r484035

Mark BROKEN: fails to build

In file included from bitblt.cpp:18:
In file included from ../include/descent.h:25:
../include/carray.h:90:20: error: reinterpret_cast from 'nullptr_t' to 'char *'
is not allowed
                        m_data.buffer = reinterpret_cast<_T *> (NULL);
                                        ^~~~~~~~~~~~~~~~~~~~~~~~~~~~~

Reported by:	pkg-fallout
[ 13:36 antoine ] Original commit 
d2x-xl 1.14.121_10 games  Broken Ignore files touched by this commit Community Unix port of Descent 2 Game
Mark BROKEN: fails to build

In file included from bitblt.cpp:18:
In file included from ../include/descent.h:25:
../include/carray.h:90:20: error: reinterpret_cast from 'nullptr_t' to 'char *'
is not allowed
                        m_data.buffer = reinterpret_cast<_T *> (NULL);
                                        ^~~~~~~~~~~~~~~~~~~~~~~~~~~~~

Reported by:	pkg-fallout
[ 13:34 antoine ] Original commit 
crtmpserver 0.811_2 net new! Broken Ignore files touched by this commit C++ RTSP/RTMP/MPEG-TS Server
MFH: r484033

Mark BROKEN: fails to build

/wrkdirs/usr/ports/net/crtmpserver/work/crtmpserver-0.811/sources/common/src/platform/freebsd/freebsdplatform.cpp:271:33:
error: invalid suffix on literal; C++11 requires a space between literal and
identifier [-Wreserved-user-defined-literal]
                WARN("Unable to set IP_TTL: %"PRIu8"; error was (%d) %s", ttl,
err, strerror(err));
                                              ^

Reported by:	pkg-fallout
[ 13:34 antoine ] Original commit 
crtmpserver 0.811_2 net  Broken Ignore files touched by this commit C++ RTSP/RTMP/MPEG-TS Server
Mark BROKEN: fails to build

/wrkdirs/usr/ports/net/crtmpserver/work/crtmpserver-0.811/sources/common/src/platform/freebsd/freebsdplatform.cpp:271:33:
error: invalid suffix on literal; C++11 requires a space between literal and
identifier [-Wreserved-user-defined-literal]
                WARN("Unable to set IP_TTL: %"PRIu8"; error was (%d) %s", ttl,
err, strerror(err));
                                              ^

Reported by:	pkg-fallout
[ 13:29 antoine ] Original commit 
crimson 0.5.3_5 games new! Broken Ignore files touched by this commit Tactical war game in the tradition of Battle Isle
MFH: r484031

Mark BROKEN: fails to build

main.cpp:176:31: error: invalid suffix on literal; C++11 requires a space
between literal and identifier [-Wreserved-user-defined-literal]
        cout << PROGRAMNAME" "VERSION << endl;
                              ^

Reported by:	pkg-fallout
[ 13:29 antoine ] Original commit 
crimson 0.5.3_5 games files touched by this commit Tactical war game in the tradition of Battle Isle
Mark BROKEN: fails to build

main.cpp:176:31: error: invalid suffix on literal; C++11 requires a space
between literal and identifier [-Wreserved-user-defined-literal]
        cout << PROGRAMNAME" "VERSION << endl;
                              ^

Reported by:	pkg-fallout
[ 13:26 antoine ] Original commit 
chanta 0.15_12 games new! Broken Ignore files touched by this commit Free 2D jump and run game
MFH: r484029

Mark BROKEN: fails to build

Mundo.cpp:262:19: error: non-constant-expression cannot be narrowed from type
'int' to 'Sint16' (aka 'short') in initializer list [-Wc++11-narrowing]
        SDL_Rect rect = {x, y, w, h};
                         ^

Reported by:	pkg-fallout
[ 13:26 antoine ] Original commit 
chanta 0.15_12 games  Broken Ignore files touched by this commit Free 2D jump and run game
Mark BROKEN: fails to build

Mundo.cpp:262:19: error: non-constant-expression cannot be narrowed from type
'int' to 'Sint16' (aka 'short') in initializer list [-Wc++11-narrowing]
        SDL_Rect rect = {x, y, w, h};
                         ^

Reported by:	pkg-fallout
[ 13:24 antoine ] Original commit 
centreon-clib 1.4.2 net-mgmt new! Broken Ignore files touched by this commit Common library of all Centreon projects written in C or C++
MFH: r484027

Mark BROKEN: fails to build

In file included from src/process_manager_posix.cc:32:
In file included from build/../inc/com/centreon/process_manager_posix.hh:30:
build/../inc/com/centreon/unordered_hash.hh:74:12: error: class template partial
specialization of 'hash' not in a namespace enclosing '__1'
    struct hash<std::pair<T, U> > {
           ^

Reported by:	pkg-fallout
[ 13:24 antoine ] Original commit 
centreon-clib 1.4.2 net-mgmt  Broken Ignore files touched by this commit Common library of all Centreon projects written in C or C++
Mark BROKEN: fails to build

In file included from src/process_manager_posix.cc:32:
In file included from build/../inc/com/centreon/process_manager_posix.hh:30:
build/../inc/com/centreon/unordered_hash.hh:74:12: error: class template partial
specialization of 'hash' not in a namespace enclosing '__1'
    struct hash<std::pair<T, U> > {
           ^

Reported by:	pkg-fallout
[ 13:21 antoine ] Original commit 
ceferino 0.97.8_15 games new! Broken Ignore files touched by this commit Game similar to Super Pang
MFH: r484025

Mark BROKEN: fails to build

juego.cc:119:24: error: non-constant-expression cannot be narrowed from type
'int' to 'Uint16' (aka 'unsigned short') in initializer list [-Wc++11-narrowing]
        SDL_Rect rect = {0,0, screen->w, screen->h - screen->h/15};
                              ^~~~~~~~~

Reported by:	pkg-fallout
[ 13:20 antoine ] Original commit 
ceferino 0.97.8_15 games  Broken Ignore files touched by this commit Game similar to Super Pang
Mark BROKEN: fails to build

juego.cc:119:24: error: non-constant-expression cannot be narrowed from type
'int' to 'Uint16' (aka 'unsigned short') in initializer list [-Wc++11-narrowing]
        SDL_Rect rect = {0,0, screen->w, screen->h - screen->h/15};
                              ^~~~~~~~~

Reported by:	pkg-fallout
[ 13:13 antoine ] Original commit 
brlcad 7.24.0_8 cad new! Broken Ignore files touched by this commit CSG modelling system from the US Ballistic Research Laboratory
MFH: r484023

Mark BROKEN: fails to build

/wrkdirs/usr/ports/cad/brlcad/work/brlcad-7.24.0/src/other/openNURBS/opennurbs_archive.cpp:13560:103:
error: differing user-defined suffixes ('__DATE__' and '__TIME__') in string
literal concatenation
    rc = archive.Write3dmStartSection( version, "Archive created by
ON_WriteOneObjectArchive "__DATE__" "__TIME__ );
                                               
~~~~~~~~~~~~~~~~~~~~~~~~~~~~~~~~~~~~~~~~~~~~~~~~~~~~~~^~~~~~~~~~~

Reported by:	pkg-fallout
[ 13:13 antoine ] Original commit 
brlcad 7.24.0_8 cad  Broken Ignore files touched by this commit CSG modelling system from the US Ballistic Research Laboratory
Mark BROKEN: fails to build

/wrkdirs/usr/ports/cad/brlcad/work/brlcad-7.24.0/src/other/openNURBS/opennurbs_archive.cpp:13560:103:
error: differing user-defined suffixes ('__DATE__' and '__TIME__') in string
literal concatenation
    rc = archive.Write3dmStartSection( version, "Archive created by
ON_WriteOneObjectArchive "__DATE__" "__TIME__ );
                                               
~~~~~~~~~~~~~~~~~~~~~~~~~~~~~~~~~~~~~~~~~~~~~~~~~~~~~~^~~~~~~~~~~

Reported by:	pkg-fallout
[ 13:09 antoine ] Original commit 
boxbackup 0.11.1_7 sysutils new! Broken Ignore files touched by this commit Open source, completely automatic on-line backup system for Unix
MFH: r484021

Mark BROKEN: fails to build

BackupStoreInfo.cpp:154:3: error: non-constant-expression cannot be narrowed
from type 'unsigned int' to 'int32_t' (aka 'int') in initializer list
[-Wc++11-narrowing]
                htonl(AccountID), // mAccountID
                ^~~~~~~~~~~~~~~~

Reported by:	pkg-fallout
[ 13:09 antoine ] Original commit 
boxbackup 0.11.1_7 sysutils  Broken Ignore files touched by this commit Open source, completely automatic on-line backup system for Unix
Mark BROKEN: fails to build

BackupStoreInfo.cpp:154:3: error: non-constant-expression cannot be narrowed
from type 'unsigned int' to 'int32_t' (aka 'int') in initializer list
[-Wc++11-narrowing]
                htonl(AccountID), // mAccountID
                ^~~~~~~~~~~~~~~~

Reported by:	pkg-fallout
[ 13:04 antoine ] Original commit 
boswars 2.6.1_10 games new! Broken Ignore files touched by this commit Futuristic real-time strategy game
MFH: r484019

Mark BROKEN: fails to build

engine/map/minimap.cpp:490:21: error: non-constant-expression cannot be narrowed
from type 'int' to 'Sint16' (aka 'short') in initializer list
[-Wc++11-narrowing]
                SDL_Rect drect = {X, Y, 0, 0};
                                  ^

Reported by:	pkg-fallout
[ 13:04 antoine ] Original commit 
boswars 2.6.1_10 games  Broken Ignore files touched by this commit Futuristic real-time strategy game
Mark BROKEN: fails to build

engine/map/minimap.cpp:490:21: error: non-constant-expression cannot be narrowed
from type 'int' to 'Sint16' (aka 'short') in initializer list
[-Wc++11-narrowing]
                SDL_Rect drect = {X, Y, 0, 0};
                                  ^

Reported by:	pkg-fallout
[ 12:58 antoine ] Original commit 
bbcp 20150116 sysutils new! Broken Ignore files touched by this commit Secure, fast, and IPv6 capable Copy utility
MFH: r484017

Mark BROKEN: fails to build

bbcp_Protocol.C:928:51: error: non-constant-expression cannot be narrowed from
type 'int' to 'size_t' (aka 'unsigned long') in initializer list
[-Wc++11-narrowing]
                        {(char *)" ", 1}, {csVal, csVsz},
                                                  ^~~~~

Reported by:	pkg-fallout
[ 12:57 antoine ] Original commit 
bbcp 20150116 sysutils  Broken Ignore files touched by this commit Secure, fast, and IPv6 capable Copy utility
Mark BROKEN: fails to build

bbcp_Protocol.C:928:51: error: non-constant-expression cannot be narrowed from
type 'int' to 'size_t' (aka 'unsigned long') in initializer list
[-Wc++11-narrowing]
                        {(char *)" ", 1}, {csVal, csVsz},
                                                  ^~~~~

Reported by:	pkg-fallout
[ 12:55 antoine ] Original commit 
audiere 1.9.4_7 audio new! Broken Ignore files touched by this commit High-level audio API
MFH: r484015

Mark BROKEN: fails to build

/usr/local/include/dumb.h:41:27: error: invalid suffix on literal; C++11
requires a space between literal and identifier
[-Wreserved-user-defined-literal]
#define DUMB_NAME "DUMB v"DUMB_VERSION_STR
                          ^

Reported by:	pkg-fallout
[ 12:54 antoine ] Original commit 
audiere 1.9.4_7 audio  Broken Ignore files touched by this commit High-level audio API
Mark BROKEN: fails to build

/usr/local/include/dumb.h:41:27: error: invalid suffix on literal; C++11
requires a space between literal and identifier
[-Wreserved-user-defined-literal]
#define DUMB_NAME "DUMB v"DUMB_VERSION_STR
                          ^

Reported by:	pkg-fallout
[ 12:52 antoine ] Original commit 
asdcplib 1.11.49_2 multimedia new! Broken Ignore files touched by this commit Open source implementation of SMPTE and the MXF Interop format
MFH: r484013

Mark BROKEN: fails to build

PCMParserList.cpp:115:3: error: comparison between pointer and integer ('const
char *' and 'int')
  ASDCP_TEST_NULL_STR(argv);
  ^~~~~~~~~~~~~~~~~~~~~~~~~

Reported by:	pkg-fallout
Number of commits: 5671 (showing only 100 on this page) 1 | 2 | 3 | 4 | 5 | 6 | 7 | 8 | 9 | 10 | 11  »  [57]
Login
User Login
Create account

Servers and bandwidth provided by
New York Internet, SuperNews, and RootBSD

This site
What is FreshPorts?
About the authors
Issues
FAQ
How big is it?
The latest upgrade!
Privacy
Forums
Blog
Contact

Search
Enter Keywords:
 
more...

Latest Vulnerabilities
linux-flashplayerNov 13
kio-extrasNov 12
opensslNov 12
openjpeg*Nov 11
patch*Nov 11
libressl*Nov 10
libressl-devel*Nov 10
openssl-devel*Nov 10
openssl111*Nov 10
lighttpdNov 09
mariadb100-server*Nov 08
mariadb101-server*Nov 08
mariadb102-server*Nov 08
mariadb103-server*Nov 08
mariadb55-server*Nov 08

15 vulnerabilities affecting 148 ports have been reported in the past 14 days

* - modified, not new

All vulnerabilities

Last updated:
2018-11-13 23:13:01


Ports
Home
Categories
Deleted ports
Sanity Test Failures
Newsfeeds

Statistics
Graphs
NEW Graphs (Javascript)
Traffic

Calculated hourly:
Port count 35967
Broken 114
Deprecated 588
Ignore 380
Forbidden 3
Restricted 162
No CDROM 74
Vulnerable 39
Expired 5
Set to expire 561
Interactive 0
new 24 hours 2
new 48 hours5
new 7 days20
new fortnight49
new month149

Servers and bandwidth provided by
New York Internet, SuperNews, and RootBSD
Valid HTML, CSS, and RSS.
Copyright © 2000-2018 Dan Langille. All rights reserved.