FreshPorts -- The Place For Ports notbugIf you buy from Amazon USA, please support us by using this link.
Follow us
Blog
Twitter

Search FreshPorts using Google
not searching src

The FreshPorts Search


Include deleted ports Case sensitive search Sort by:
Include /src tree
Output format:
HTML
Plain Text
Maximum Effort Minimal output
Branch:

Notes

  • Case sensitivity is ignored for "sounds like" and output is ordered by the soundex.
  • When searching on 'Message ID', the type of match is ignored.
  • When searching on 'Commit Message' only 'containing' is used.
  • When searching by 'Under a pathname', your path must start with something like /ports/, /doc/, or /src/. All commits under that point will be returned. The selected match type is ignored and defaults to 'Starts with'.
  • Searching for 'sounds like' is only valid for Committer, Maintainer, Package Name, and Port Name.
Number of commits: 3349 (showing only 100 on this page) 1 | 2 | 3 | 4 | 5 | 6 | 7 | 8 | 9 | 10 | 11  »  [34]
Tue, 24 Apr 2018
[ 13:58 jbeich ] Original commit 
chromium 65.0.3325.181_2 www files touched by this commit Google web browser based on WebKit
www/chromium: unbreak with ffmpeg 4.0

../../media/ffmpeg/ffmpeg_common.cc:36:1: error: static_assert failed
"DecoderBuffer padding size does not fit ffmpeg requirement"
static_assert(DecoderBuffer::kPaddingSize >= AV_INPUT_BUFFER_PADDING_SIZE,
^             ~~~~~~~~~~~~~~~~~~~~~~~~~~~~~~~~~~~~~~~~~~~~~~~~~~~~~~~~~~~

PR:		227726
Obtained from:	upstream
[ 13:58 jbeich ] Original commit 
libxul 45.9.0_12 www  Deprecated Expiration Date files touched by this commit Mozilla runtime package that can be used to bootstrap XUL+XPCOM apps
palemoon 27.9.0_1 www files touched by this commit Open Source Goanna-based web browser
www/palemoon: unbreak h264/aac/mp3 with ffmpeg 4.0

PR:		227726
Obtained from:	upstream (Firefox 61)
[ 13:57 jbeich ] Original commit 
thunderbird 52.7.0_3 mail files touched by this commit Mozilla Thunderbird is standalone mail and news that stands above
firefox-esr 52.7.3_2,1 www files touched by this commit Web browser based on the browser portion of Mozilla
seamonkey 2.49.3_2 www files touched by this commit The open source, standards compliant web browser
www/seamonkey: unbreak h264/aac/mp3 with ffmpeg 4.0

PR:		227726
Obtained from:	upstream (Firefox 61)
[ 13:57 jbeich ] Original commit 
ppsspp 1.5.4 emulators files touched by this commit PSP emulator in C++ with dynarec JIT for x86, ARM, MIPS
emulators/ppsspp: unbreak with ffmpeg 4.0

Core/HLE/sceMpeg.cpp:890:27: error: use of undeclared identifier
'FF_INPUT_BUFFER_PADDING_SIZE'
                u8* str = new u8[size + FF_INPUT_BUFFER_PADDING_SIZE];
                                        ^
Core/HLE/sceMpeg.cpp:892:25: error: use of undeclared identifier
'FF_INPUT_BUFFER_PADDING_SIZE'
                memset(str + size, 0, FF_INPUT_BUFFER_PADDING_SIZE);
                                      ^
Core/HLE/sceMpeg.cpp:893:11: error: use of undeclared identifier
'FF_INPUT_BUFFER_PADDING_SIZE'
                size += FF_INPUT_BUFFER_PADDING_SIZE;
                        ^

PR:		227726
Obtained from:	upstream
[ 13:57 jbeich ] Original commit 
renpy6 6.18.3_5 devel files touched by this commit Framework for developing visual-novel type games
devel/renpy6: unbreak with ffmpeg 4.0

ffdecode.c:840:67: error: use of undeclared identifier 'CODEC_CAP_DELAY'
                if (!pkt_temp->data && dec->codec->capabilities &
CODEC_CAP_DELAY)
                                                                  ^
ffdecode.c:1246:29: error: use of undeclared identifier 'CODEC_FLAG2_FAST'
    if(fast) enc->flags2 |= CODEC_FLAG2_FAST;
                            ^

PR:		227726
[ 13:57 jbeich ] Original commit 
moc 2.5.2_1 audio files touched by this commit Console audio player designed to be powerful and easy to use
audio/moc: unbreak with ffmpeg 4.0

ffmpeg.c:996:34: error: use of undeclared identifier 'CODEC_CAP_TRUNCATED'
        if (data->codec->capabilities & CODEC_CAP_TRUNCATED)
                                        ^
ffmpeg.c:997:23: error: use of undeclared identifier 'CODEC_FLAG_TRUNCATED'
                data->enc->flags |= CODEC_FLAG_TRUNCATED;
                                    ^
ffmpeg.c:1028:34: error: use of undeclared identifier 'CODEC_CAP_DELAY'
        if (data->codec->capabilities & CODEC_CAP_DELAY)
                                        ^

PR:		227726
Obtained from:	Greg V
[ 13:56 jbeich ] Original commit 
cmus 2.8.0.r0_5 audio files touched by this commit Console-based music player with really cool features
audio/cmus: unbreak with ffmpeg 4.0

checking for FFMPEG_LIBS (pkg-config)... -L/usr/local/lib -lavformat -lavcodec
checking for FFMPEG_CFLAGS (pkg-config)... -I/usr/local/include
checking for header <libavcodec/avcodec.h>... yes
checking for successful build of ffmpeg.c... no
[...]
ip/ffmpeg.c:255:29: error: use of undeclared identifier 'CODEC_CAP_TRUNCATED'
                if (codec->capabilities & CODEC_CAP_TRUNCATED)
                                          ^
ip/ffmpeg.c:256:17: error: use of undeclared identifier 'CODEC_FLAG_TRUNCATED'
                        cc->flags |= CODEC_FLAG_TRUNCATED;
                                     ^

PR:		227726
Obtained from:	upstream (via Greg V)
[ 13:56 jbeich ] Original commit 
gegl3 0.3.20_3 graphics files touched by this commit Graph based image processing framework
graphics/gegl3: unbreak with ffmpeg 4.0

./ff-save.c:293:17: error: use of undeclared identifier
'CODEC_FLAG_GLOBAL_HEADER'
    c->flags |= CODEC_FLAG_GLOBAL_HEADER;
                ^
./ff-save.c:634:18: error: use of undeclared identifier
'CODEC_FLAG_GLOBAL_HEADER'
     c->flags |= CODEC_FLAG_GLOBAL_HEADER;
                 ^
./ff-save.c:702:30: error: use of undeclared identifier 'AVFMT_RAWPICTURE'
  if (!(oc->oformat->flags & AVFMT_RAWPICTURE))
                             ^
./ff-save.c:806:28: error: use of undeclared identifier 'AVFMT_RAWPICTURE'
  if (oc->oformat->flags & AVFMT_RAWPICTURE)
                           ^

PR:		227726
[ 13:56 jbeich ] Original commit 
gegl 0.2.0_21 graphics files touched by this commit Graph based image processing framework
graphics/gegl: unbreak with ffmpeg 4.0

./ff-load.c:312:36: error: use of undeclared identifier 'CODEC_CAP_TRUNCATED'
      if (p->codec->capabilities & CODEC_CAP_TRUNCATED)
                                   ^
./ff-load.c:313:26: error: use of undeclared identifier 'CODEC_FLAG_TRUNCATED'
        p->enc->flags |= CODEC_FLAG_TRUNCATED;

PR:		227726
[ 13:56 jbeich ] Original commit 
openimageio 1.7.17_9 graphics files touched by this commit OpenImageIO graphics library
graphics/openimageio: link to actual commit instead
[ 00:53 jbeich ] Original commit 
openbor 5034 games files touched by this commit Moddable fighting game engine (aka Beats of Rage)
MFH: r468169

games/openbor: update to 5034

Changes:	https://github.com/DCurrent/openbor/compare/449e528...f47df2b0
Approved by:	ports-secteam (feld, implicit for snapshots)
[ 00:53 jbeich ] Original commit 
openbor 5034 games files touched by this commit Moddable fighting game engine (aka Beats of Rage)
games/openbor: update to 5034

Changes:	https://github.com/DCurrent/openbor/compare/449e528...f47df2b0
[ 00:38 jbeich ] Original commit 
waterfox 56.1.0_15 www  Deprecated Expiration Date files touched by this commit Distilled fork of Firefox
MFH: r468160

www/waterfox: apply a FF60 fix

Approved by:	ports-secteam blanket
[ 00:30 jbeich ] Original commit 
rpcs3 0.0.5.215 emulators files touched by this commit PS3 emulator/debugger
MFH: r468156

emulators/rpcs3: update to 0.0.5.215

Changes:	https://github.com/RPCS3/rpcs3/compare/eb3dfb6bb...bd1d4de42
Approved by:	ports-secteam (junovitch, implicit for snapshots)
[ 00:18 jbeich ] Original commit 
beignet 1.3.2_2 lang files touched by this commit OpenCL library for Intel GPUs
lang/beignet: install CL/cl_inet.h

/tmp/ffconf.XXXXXXXX/test.c:1:10: fatal error: 'CL/cl_intel.h' file not found
 #include <CL/cl_intel.h>
          ^~~~~~~~~~~~~~~

https://git.ffmpeg.org/gitweb/ffmpeg.git/commitdiff/ac993e73deca

PR:		227726
[ 00:18 jbeich ] Original commit 
waterfox 56.1.0_15 www  Deprecated Expiration Date files touched by this commit Distilled fork of Firefox
www/waterfox: apply a FF60 fix
[ 00:18 jbeich ] Original commit 
firefox 59.0.2_7,1 www files touched by this commit Web browser based on the browser portion of Mozilla
waterfox 56.1.0_14 www  Deprecated Expiration Date files touched by this commit Distilled fork of Firefox
www/firefox: unbreak h264/aac/mp3 with ffmpeg 4.0

PR:		227726
Obtained from:	upstream
[ 00:17 jbeich ] Original commit 
openimageio 1.7.17_9 graphics files touched by this commit OpenImageIO graphics library
graphics/openimageio: unbreak with ffmpeg 4.0

src/ffmpeg.imageio/ffmpeginput.cpp:333:72: error: use of undeclared identifier
'CODEC_CAP_DELAY'
    m_codec_cap_delay = (bool) (m_codec_context->codec->capabilities &
CODEC_CAP_DELAY);
                                                                       ^

PR:		227726
Obtained from:	upstream
[ 00:17 jbeich ] Original commit 
opencv 2.4.13.1_9 graphics files touched by this commit Open Source Computer Vision library
graphics/opencv: unbreak with ffmpeg 4.0

In file included from modules/highgui/src/cap_ffmpeg.cpp:45:
modules/highgui/src/cap_ffmpeg_impl.hpp:1481:21: error: use of undeclared
identifier 'CODEC_FLAG_GLOBAL_HEADER'
        c->flags |= CODEC_FLAG_GLOBAL_HEADER;
                    ^
modules/highgui/src/cap_ffmpeg_impl.hpp:1505:30: error: use of undeclared
identifier 'AVFMT_RAWPICTURE'
    if (oc->oformat->flags & AVFMT_RAWPICTURE) {
                             ^
modules/highgui/src/cap_ffmpeg_impl.hpp:1679:35: error: use of undeclared
identifier 'AVFMT_RAWPICTURE'
        if( (oc->oformat->flags & AVFMT_RAWPICTURE) == 0 )
                                  ^
modules/highgui/src/cap_ffmpeg_impl.hpp:1913:32: error: use of undeclared
identifier 'AVFMT_RAWPICTURE'
    if (!(oc->oformat->flags & AVFMT_RAWPICTURE)) {
                               ^
modules/highgui/src/cap_ffmpeg_impl.hpp:2207:25: error: use of undeclared
identifier 'CODEC_FLAG_GLOBAL_HEADER'
            c->flags |= CODEC_FLAG_GLOBAL_HEADER;
                        ^

PR:		227726
Obtained from:	upstream (via Homebrew)
[ 00:16 jbeich ] Original commit 
rpcs3 0.0.5.215 emulators files touched by this commit PS3 emulator/debugger
emulators/rpcs3: unbreak with ffmpeg 4.0 by updating to 0.0.5.215

rpcs3/Emu/Cell/Modules/cellAdec.cpp:232:40: error: use of undeclared identifier
'FF_INPUT_BUFFER_PADDING_SIZE'
                                                        data = (u8*)av_calloc(1,
size + FF_INPUT_BUFFER_PADDING_SIZE);
                                                                                
       ^
rpcs3/Emu/Cell/Modules/cellAdec.cpp:233:28: error: use of undeclared identifier
'FF_INPUT_BUFFER_PADDING_SIZE'
                                                        this->size = size +
FF_INPUT_BUFFER_PADDING_SIZE;
                                                                            ^
    ^

Changes:	https://github.com/RPCS3/rpcs3/compare/eb3dfb6bb...bd1d4de42
PR:		227726
[ 00:08 jbeich ] Original commit 
citra s20180422 emulators files touched by this commit Nintendo 3DS emulator/debugger
MFH: r468037

emulators/citra: update to s20180422

Changes:	https://github.com/citra-emu/citra/compare/048b0fc0...7d8b7d93
Approved by:	ports-secteam (swills, implicit for snapshots)
Sun, 22 Apr 2018
[ 20:18 jbeich ] Original commit 
py-pytest-tornado 0.5.0 devel new! files touched by this commit Py.test plugin providing fixtures and markers for tornado
MFH: r468041

devel/py-pytest-tornado: update to 0.5.0

Changes:	https://github.com/eugeniy/pytest-tornado/compare/v0.4.5...v0.5.0
Approved by:	ports-secteam (riggs)
[ 17:30 jbeich ] Original commit 
py-pytest-tornado 0.5.0 devel files touched by this commit Py.test plugin providing fixtures and markers for tornado
devel/py-pytest-tornado: update to 0.5.0

Changes:	https://github.com/eugeniy/pytest-tornado/compare/v0.4.5...v0.5.0
MFH:		2018Q2 (r464162 compat)
[ 16:39 jbeich ] Original commit 
dnsdist 1.3.0_3 dns files touched by this commit Highly DNS-, DoS- and abuse-aware loadbalancer
dns/dnsdist: convert to USES=compiler
[ 16:39 jbeich ] Original commit 
citra s20180422 emulators files touched by this commit Nintendo 3DS emulator/debugger
emulators/citra: update to s20180422

Changes:	https://github.com/citra-emu/citra/compare/048b0fc0...7d8b7d93
Fri, 20 Apr 2018
[ 23:00 jbeich ] Original commit 
waterfox 56.1.0_13 www  Deprecated Expiration Date files touched by this commit Distilled fork of Firefox
MFH: r467839

www/waterfox: apply some FF60 fixes

Approved by:	ports-secteam blanket
[ 20:15 jbeich ] Original commit 
ceph 12.2.4 net new! files touched by this commit Ceph delivers object, block, and file storage in a unified system
MFH: r467840

net/ceph: drop bogus flavor specifier

Unsuffixed binaries are only installed for default python version.

$ DEFAULT_VERSIONS=python=3.6 make
[...]
===>   ceph-12.2.4_1 depends on executable: sphinx-build - not found
===>   ceph-12.2.4_1 depends on executable: virtualenv - not found

PR:		227260
Approved by:	ports-secteam blanket
[ 20:08 jbeich ] Original commit 
ceph 12.2.4_1 net files touched by this commit Ceph delivers object, block, and file storage in a unified system
net/ceph: drop bogus flavor specifier

Unsuffixed binaries are only installed for default python version.

$ DEFAULT_VERSIONS=python=3.6 make
[...]
===>   ceph-12.2.4_1 depends on executable: sphinx-build - not found
===>   ceph-12.2.4_1 depends on executable: virtualenv - not found

PR:		227260
[ 20:08 jbeich ] Original commit 
waterfox 56.1.0_13 www  Deprecated Expiration Date files touched by this commit Distilled fork of Firefox
www/waterfox: apply some FF60 fixes
[ 02:31 jbeich ] Original commit 
pcl-pointclouds 1.8.1_3 graphics files touched by this commit Point Cloud Library
graphics/pcl-pointclouds: unbreak with boost 1.67

In file included from
/wrkdirs/usr/ports/graphics/pcl-pointclouds/work/pcl-pcl-1.8.1/outofcore/tools/outofcore_process.cpp:53:
In file included from
/wrkdirs/usr/ports/graphics/pcl-pointclouds/work/pcl-pcl-1.8.1/outofcore/include/pcl/outofcore/outofcore_impl.h:50:
/wrkdirs/usr/ports/graphics/pcl-pointclouds/work/pcl-pcl-1.8.1/outofcore/include/pcl/outofcore/impl/octree_disk_container.hpp:77:74:
error: no matching constructor for initialization of
'boost::uuids::random_generator' (aka 'boost::uuids::random_generator_pure')
    boost::uuids::random_generator
OutofcoreOctreeDiskContainer<PointT>::uuid_gen_ (&rand_gen_);
                                                                         ^      
   ~~~~~~~~~~
/usr/local/include/boost/uuid/random_generator.hpp:149:7: note: candidate
constructor (the implicit copy constructor) not viable: no known conversion from
'boost::mt19937 *' (aka 'mersenne_twister_engine<unsigned int, 32, 624, 397, 31,
2567483615U, 11, 4294967295U, 7, 2636928640U, 15, 4022730752U, 18, 1812433253>
*') to 'const boost::uuids::random_generator_pure' for 1st argument
class random_generator_pure
      ^
/usr/local/include/boost/uuid/random_generator.hpp:149:7: note: candidate
constructor (the implicit default constructor) not viable: requires 0 arguments,
but 1 was provided

PR:		227427
Reported by:	antoine (via exp-run)
Obtained from:	Homebrew
Thu, 19 Apr 2018
[ 07:28 jbeich ] Original commit 
monero-cli 0.12.0.0_1 net-p2p files touched by this commit Private, secure, untraceable, decentralised digital currency (CLI)
net-p2p/monero-cli: switch to upstream patch
[ 00:34 jbeich ] Original commit 
rpcs3 0.0.5.200 emulators files touched by this commit PS3 emulator/debugger
MFH: r467743

emulators/rpcs3: update to 0.0.5.198

Changes:	https://github.com/RPCS3/rpcs3/compare/6baf67520...eb3dfb6bb
Approved by:	ports-secteam (junovitch, implicit for snapshots)
[ 00:33 jbeich ] Original commit 
citra s20180418 emulators files touched by this commit Nintendo 3DS emulator/debugger
MFH: r467742

emulators/citra: update to s20180418

Changes:	https://github.com/citra-emu/citra/compare/cb36f9fa...048b0fc0
Approved by:	ports-secteam (swills, implicit for snapshots)
[ 00:32 jbeich ] Original commit 
waterfox 56.1.0_12 www  Deprecated Expiration Date files touched by this commit Distilled fork of Firefox
MFH: r467741

www/waterfox: apply some FF60 fix

Approved by:	ports-secteam blanket
[ 00:31 jbeich ] Original commit 
rpcs3 0.0.5.200 emulators files touched by this commit PS3 emulator/debugger
emulators/rpcs3: update to 0.0.5.198

Changes:	https://github.com/RPCS3/rpcs3/compare/6baf67520...eb3dfb6bb
[ 00:31 jbeich ] Original commit 
citra s20180418 emulators files touched by this commit Nintendo 3DS emulator/debugger
citra-qt5 s20180418 emulators files touched by this commit Nintendo 3DS emulator/debugger
emulators/citra: update to s20180418

Changes:	https://github.com/citra-emu/citra/compare/cb36f9fa...048b0fc0
[ 00:30 jbeich ] Original commit 
waterfox 56.1.0_12 www  Deprecated Expiration Date files touched by this commit Distilled fork of Firefox
www/waterfox: apply some FF60 fix
Wed, 18 Apr 2018
[ 17:48 jbeich ] Original commit 
mesa-dri 18.0.1 graphics files touched by this commit OpenGL hardware acceleration drivers for DRI2+
graphics/mesa-{libs,dri}: update to 18.0.1

Changes:	https://www.mesa3d.org/relnotes/18.0.1.html
PR:		225415
[ 17:48 jbeich ] Original commit 
boost-libs 1.67.0_1 devel files touched by this commit Free portable C++ libraries (without Boost.Python)
devel/boost-libs: backport minor regression fix

/usr/local/include/boost/lockfree/spsc_queue.hpp:140:43: error: no member named
'next' in namespace 'boost'
        const ConstIterator last = boost::next(begin, input_count);
                                   ~~~~~~~^
/usr/local/include/boost/lockfree/spsc_queue.hpp:145:51: error: no member named
'next' in namespace 'boost'
            const ConstIterator midpoint = boost::next(begin, count0);
                                           ~~~~~~~^

Obtained from:	upstream (via Homebrew)
[ 14:06 jbeich ] Original commit 
libosmium 2.14.0_1 astro files touched by this commit Fast and flexible C++ library for working with OpenStreetMap data
gqrx 2.11.4_1,1 comms files touched by this commit Software defined radio receiver powered by GNU Radio and Qt
avro-cpp 1.8.2_1 devel files touched by this commit C++ library for Apache Avro
cloudcompare 2.9.1.288_1 graphics new! files touched by this commit 3D point cloud processing software
litecoin 0.14.2_5 net-p2p files touched by this commit Virtual Peer-to-Peer Currency Client (QT)
monero-cli 0.12.0.0_1 net-p2p files touched by this commit Private, secure, untraceable, decentralised digital currency (CLI)
qtum 0.14.15_1 net-p2p files touched by this commit PoS cryptocurrency that can execute smart contract as part of an UTXO
nghttp2 1.31.1_1 www files touched by this commit HTTP/2.0 C Library
Adjust PORTREVISION order to pet portlint after r467711

Tools/scripts/bump-revision.sh adds PORTREVISION in the wrong place
when DISTVERSION*FIX is used.
[ 13:58 jbeich ] Original commit 
cmake 3.11.0_2 devel files touched by this commit Cross-platform Makefile generator
devel/cmake: allow consumers to qualify boost_python version

PR:		227428
Exp-run by:	antoine
[ 13:57 jbeich ] Original commit 
innoextract 1.6_7 archivers files touched by this commit Program to extract Inno Setup files
tardy 1.28_9 archivers files touched by this commit Manipulate the file headers in tar archive files in various ways
libkgeomap 17.12.3_1 astro files touched by this commit KDE library for browsing photos on a map
libkgeomap-kde4 15.04.3_10 astro files touched by this commit KDE4 library for browsing photos on a map
libosmium 2.14.0_1 astro files touched by this commit Fast and flexible C++ library for working with OpenStreetMap data
ardour 2.8.16_10 audio files touched by this commit Multichannel digital audio workstation
ardour5 5.12.0_2 audio files touched by this commit Multichannel digital audio workstation
clementine-player 1.3.1_21 audio files touched by this commit Cross-platform music player based on Amarok 1.4
cpp-xmms2 0.8_15 audio files touched by this commit C++ Bindings for XMMS2
csound6 6.06_15 audio files touched by this commit Sound synthesizer

(Only the first 10 of 378 ports in this commit are shown above. View all ports for this commit)
devel/boost-*: update to 1.67.0

Changes:	http://www.boost.org/users/history/version_1_67_0.html
PR:		227427
Exp-run by:	antoine
Differential Revision:	https://reviews.freebsd.org/D15030
[ 12:54 jbeich ] Original commit 
solidity 0.4.21 lang files touched by this commit Solidity Contract-Oriented Programming Language
lang/solidity: unbreak with boost 1.67 on 10.*

In file included from libjulia/optimiser/FunctionGrouper.cpp:22:
In file included from ./libjulia/optimiser/FunctionGrouper.h:24:
In file included from ./libjulia/ASTDataForward.h:24:
In file included from ./libsolidity/inlineasm/AsmDataForward.h:25:
In file included from /usr/local/include/boost/variant.hpp:17:
In file included from /usr/local/include/boost/variant/variant.hpp:21:
In file included from /usr/local/include/boost/type_index.hpp:29:
In file included from /usr/local/include/boost/type_index/stl_type_index.hpp:43:
In file included from /usr/local/include/boost/container_hash/hash.hpp:760:
In file included from /usr/local/include/boost/container_hash/extensions.hpp:22:
In file included from /usr/local/include/boost/detail/container_fwd.hpp:93:
/usr/include/c++/v1/vector:504:70: error: no member named 'value' in
'std::__1::is_nothrow_default_constructible<std::__1::allocator<boost::variant<dev::solidity::assembly::ExpressionStatement,
dev::solidity::assembly::Instruction, dev::solidity::assembly::Label,
dev::solidity::assembly::StackAssignment, dev::solidity::assembly::Assignment,
dev::solidity::assembly::VariableDeclaration,
dev::solidity::assembly::FunctionDefinition, dev::solidity::assembly::If,
dev::solidity::assembly::Switch, dev::solidity::assembly::ForLoop,
dev::solidity::assembly::Block> > >'
        _NOEXCEPT_(is_nothrow_default_constructible<allocator_type>::value)
(Only the first 15 lines of the commit message are shown above View all of this commit message)
[ 12:38 jbeich ] Original commit 
gnuradio 3.7.11_1 comms files touched by this commit Amateur Radio Software defined radio
comms/gnuradio: unbreak with boost 1.67

gr-blocks/lib/message_strobe_impl.cc:93:35: error: no matching conversion for
functional-style cast from 'float' to 'boost::posix_time::milliseconds' (aka
'subsecond_duration<boost::posix_time::time_duration, 1000>')
        boost::this_thread::sleep(boost::posix_time::milliseconds(d_period_ms));
                                  ^~~~~~~~~~~~~~~~~~~~~~~~~~~~~~~~~~~~~~~~~~~
/usr/local/include/boost/date_time/time_duration.hpp:270:30: note: candidate
constructor (the implicit copy constructor) not viable: no known conversion from
'float' to 'const
boost::date_time::subsecond_duration<boost::posix_time::time_duration, 1000>'
for 1st argument
  class BOOST_SYMBOL_VISIBLE subsecond_duration : public base_duration
                             ^
/usr/local/include/boost/date_time/time_duration.hpp:286:59: note: candidate
template ignored: disabled by 'enable_if' [with T = float]
                                typename boost::enable_if<boost::is_integral<T>,
void>::type* = 0) :
                                                          ^

/usr/local/bin/ld: CMakeFiles/tags_demo.dir/tags_demo.cc.o: undefined reference
to symbol 'pthread_condattr_init@@FBSD_1.0'
//lib/libthr.so.3: error adding symbols: DSO missing from command line
c++: error: linker command failed with exit code 1 (use -v to see invocation)
*** [gr-uhd/examples/c++/tags_demo] Error code 1

PR:		227427
Reported by:	antoine (via exp-run)
Obtained from:	Homebrew
[ 10:17 jbeich ] Original commit 
RStudio 1.1.445_1 devel files touched by this commit Integrated development environment (IDE) for R
devel/RStudio: unbreak with boost 1.67

src/cpp/core/DateTime.cpp:68:26: error: no matching conversion for
functional-style cast from 'double' to 'boost::posix_time::seconds'
   return time_t_epoch + seconds(sec);
                         ^~~~~~~~~~~
/usr/local/include/boost/date_time/posix_time/posix_time_duration.hpp:53:30:
note: candidate constructor (the implicit copy constructor) not viable: no known
conversion from 'double' to 'const boost::posix_time::seconds' for 1st argument
  class BOOST_SYMBOL_VISIBLE seconds : public time_duration
                             ^
/usr/local/include/boost/date_time/posix_time/posix_time_duration.hpp:58:37:
note: candidate template ignored: disabled by 'enable_if' [with T = double]
          typename boost::enable_if<boost::is_integral<T>, void>::type* = 0) :
                                    ^

PR:		227427
Reported by:	antoine (via exp-run)
[ 09:13 jbeich ] Original commit 
monero-cli 0.12.0.0 net-p2p files touched by this commit Private, secure, untraceable, decentralised digital currency (CLI)
net-p2p/monero-cli: unbreak with boost 1.67

In file included from src/cryptonote_basic/hardfork.cpp:33:
In file included from src/blockchain_db/blockchain_db.h:42:
In file included from src/cryptonote_basic/hardfork.h:31:
contrib/epee/include/syncobj.h:37:10: fatal error: 'boost/thread/v2/thread.hpp'
file not found
 #include <boost/thread/v2/thread.hpp>
          ^~~~~~~~~~~~~~~~~~~~~~~~~~~~
In file included from src/rpc/daemon_handler.cpp:29:
In file included from src/rpc/daemon_handler.h:36:
In file included from src/p2p/net_node.h:41:
In file included from contrib/epee/include/net/levin_server_cp2.h:32:
In file included from contrib/epee/include/net/abstract_tcp_server2.h:324:
contrib/epee/include/net/abstract_tcp_server2.inl:44:10: fatal error:
'boost/thread/v2/thread.hpp' file not found
 #include <boost/thread/v2/thread.hpp> // TODO
          ^~~~~~~~~~~~~~~~~~~~~~~~~~~~

PR:		227427
Reported by:	antoine (via exp-run)
[ 09:12 jbeich ] Original commit 
ceph 12.2.4 net files touched by this commit Ceph delivers object, block, and file storage in a unified system
net/ceph: unbreak with boost 1.67

src/rbd_replay/Replayer.cc:353:65: error: no matching conversion for
functional-style cast from 'float' to 'boost::posix_time::microseconds' (aka
'subsecond_duration<boost::posix_time::time_duration, 1000000>')
    boost::system_time sub_release_time(action_completed_time +
boost::posix_time::microseconds(dep.time_delta * m_latency_multiplier / 1000));
                                                               
^~~~~~~~~~~~~~~~~~~~~~~~~~~~~~~~~~~~~~~~~~~~~~~~~~~~~~~~~~~~~~~~~~~~~~~~~~~~

PR:		227427
Reported by:	antoine (via exp-run)
[ 08:34 jbeich ] Original commit 
vegastrike 0.5.1.r1_11 games files touched by this commit Open source 3D space simulator
games/vegastrike: unbreak with boost 1.67

/usr/bin/ld: cannot find -lboost_python
c++: error: linker command failed with exit code 1 (use -v to see invocation)
gmake[2]: *** [Makefile:3504: vegastrike] Error 1

PR:		227427
Reported by:	antoine (via exp-run)
[ 08:33 jbeich ] Original commit 
gsculpt 0.99.47_18 graphics files touched by this commit Opensource 3D modelling application
graphics/gsculpt: unbreak with boost 1.67

/usr/bin/ld: cannot find -lboost_python
c++: error: linker command failed with exit code 1 (use -v to see invocation)
scons: *** [libMath.so] Error 1

PR:		227427
Reported by:	antoine (via exp-run)
[ 08:16 jbeich ] Original commit 
condor 8.4.12 sysutils files touched by this commit High-throughput computing on distributively owned resources
sysutils/condor: unbreak with boost 1.67

[ 98%] Linking CXX shared library libclassad_python_user.so
/usr/bin/ld: cannot find -lboost_python

PR:		227427
Reported by:	antoine (via exp-run)
[ 08:04 jbeich ] Original commit 
caffe 1.0_8 graphics files touched by this commit Fast open framework for deep learning
graphics/caffe: unbreak with boost 1.67

/usr/local/bin/ld: cannot find -lboost_python
clang++: error: linker command failed with exit code 1 (use -v to see
invocation)
gmake[1]: *** [Makefile:508: python/caffe/_caffe.so] Error 1

PR:		227427
Reported by:	antoine (via exp-run)
[ 06:39 jbeich ] Original commit 
uatraits 20130430_9 devel files touched by this commit User-Agent detection library
devel/uatraits: unbreak with boost 1.67

checking for boost_python... boost_python
checking boost/python.hpp usability... yes
checking boost/python.hpp presence... yes
checking for boost/python.hpp... yes
checking linkage with boost::python... no
[...]
configure: error: boost python isn't installed for python binding

PR:		227427
Reported by:	antoine (via exp-run)
[ 06:39 jbeich ] Original commit 
openimageio 1.7.17_8 graphics files touched by this commit OpenImageIO graphics library
py-openimageio 1.7.17_8 graphics files touched by this commit OpenImageIO python bindings
graphics/py-openimageio: expose Python 3.x support after r461885
[ 06:39 jbeich ] Original commit 
openimageio 1.7.17_8 graphics files touched by this commit OpenImageIO graphics library
graphics/py-openimageio: unbreak with boost 1.67

-- Boost python support not found -- will not build python components!
[...]
install  -s -m 0644
/wrkdirs/usr/ports/graphics/py-openimageio/work/.build/src/python/OpenImageIO.so
/wrkdirs/usr/ports/graphics/py-openimageio/work/stage/usr/local/lib/python2.7/site-packages
install:
/wrkdirs/usr/ports/graphics/py-openimageio/work/.build/src/python/OpenImageIO.so:
No such file or directory

PR:		227427
Reported by:	antoine (via exp-run)
[ 06:39 jbeich ] Original commit 
mongo-cxx-driver 1.1.2_6 devel files touched by this commit MongoDB Legacy C++ Driver
devel/mongo-cxx-driver: unbreak with boost 1.67

src/mongo/client/command_writer.cpp:68:78: error: no member named 'next' in
namespace 'boost'
            const std::vector<WriteOperation*>::const_iterator next =
boost::next(batch_iter);
                                                                      ~~~~~~~^
src/mongo/util/net/message_port.h:34:38: error: expected class name
class AbstractMessagingPort : boost::noncopyable {
                                     ^

PR:		227427
Reported by:	antoine (via exp-run)
[ 06:38 jbeich ] Original commit 
mongodb34 3.4.9_2 databases files touched by this commit Distributed document-oriented "NoSQL" database
databases/mongodb34: unbreak with boost 1.67

In file included from src/third_party/yaml-cpp-0.5.3/src/convert.cpp:3:
In file included from
src/third_party/yaml-cpp-0.5.3/include/yaml-cpp/node/convert.h:17:
In file included from
src/third_party/yaml-cpp-0.5.3/include/yaml-cpp/node/impl.h:11:
In file included from
src/third_party/yaml-cpp-0.5.3/include/yaml-cpp/node/iterator.h:13:
src/third_party/yaml-cpp-0.5.3/include/yaml-cpp/node/detail/iterator.h:48:54:
error: no member named 'next' in namespace 'boost'
  void increment() { this->base_reference() = boost::next(this->base()); }
                                              ~~~~~~~^

PR:		227427
Reported by:	antoine (via exp-run)
[ 06:38 jbeich ] Original commit 
mongodb36 3.6.3 databases files touched by this commit Distributed document-oriented "NoSQL" database
databases/mongodb36: unbreak with boost 1.67

In file included from src/third_party/yaml-cpp-0.5.3/src/nodebuilder.cpp:5:
In file included from
src/third_party/yaml-cpp-0.5.3/include/yaml-cpp/node/detail/node.h:14:
In file included from
src/third_party/yaml-cpp-0.5.3/include/yaml-cpp/node/detail/node_ref.h:13:
In file included from
src/third_party/yaml-cpp-0.5.3/include/yaml-cpp/node/detail/node_data.h:20:
In file included from
src/third_party/yaml-cpp-0.5.3/include/yaml-cpp/node/iterator.h:13:
src/third_party/yaml-cpp-0.5.3/include/yaml-cpp/node/detail/iterator.h:48:54:
error: no member named 'next' in namespace 'boost'
  void increment() { this->base_reference() = boost::next(this->base()); }
                                              ~~~~~~~^

PR:		227427
Reported by:	antoine (via exp-run)
Tue, 17 Apr 2018
[ 09:33 jbeich ] Original commit 
dnsdist 1.3.0_2 dns files touched by this commit Highly DNS-, DoS- and abuse-aware loadbalancer
dns/dnsdist: unbreak with boost 1.67

In file included from dnsdist.cc:44:
In file included from ./dnsdist.hh:46:
In file included from /usr/local/include/boost/uuid/uuid_generators.hpp:17:
In file included from /usr/local/include/boost/uuid/random_generator.hpp:19:
In file included from /usr/local/include/boost/tti/has_member_function.hpp:15:
In file included from /usr/local/include/boost/tti/detail/dmem_fun.hpp:11:
In file included from
/usr/local/include/boost/function_types/is_member_function_pointer.hpp:14:
In file included from /usr/local/include/boost/function_types/components.hpp:61:
/usr/local/include/boost/function_types/detail/class_transform.hpp:26:31: error:
expected a qualified name after 'typename'
template<typename T, typename L>
                              ^
./dns.hh:238:11: note: expanded from macro 'L'
 #define L theL()
           ^

PR:		227427
Reported by:	antoine (via exp-run)
Obtained from:	upstream
[ 09:33 jbeich ] Original commit 
powerdns-recursor40 4.0.8_4 dns files touched by this commit Advanced DNS recursor
dns/powerdns-recursor40: unbreak with boost 1.67

In file included from ecs.cc:1:
In file included from ./syncres.hh:43:
In file included from ./recpacketcache.hh:39:
In file included from ./rec-protobuf.hh:24:
In file included from ./protobuf.hh:34:
In file included from /usr/local/include/boost/uuid/uuid_generators.hpp:17:
In file included from /usr/local/include/boost/uuid/random_generator.hpp:19:
In file included from /usr/local/include/boost/tti/has_member_function.hpp:15:
In file included from /usr/local/include/boost/tti/detail/dmem_fun.hpp:11:
In file included from
/usr/local/include/boost/function_types/is_member_function_pointer.hpp:14:
In file included from /usr/local/include/boost/function_types/components.hpp:61:
/usr/local/include/boost/function_types/detail/class_transform.hpp:26:31: error:
expected a qualified name after 'typename'
template<typename T, typename L>
                              ^
./recursor_cache.hh:43:11: note: expanded from macro 'L'
 #define L theL()
           ^

PR:		227427
Reported by:	antoine (via exp-run)
Obtained from:	upstream
[ 09:33 jbeich ] Original commit 
powerdns-recursor 4.1.2_2 dns files touched by this commit Advanced DNS recursor
dns/powerdns-recursor: unbreak with boost 1.67

In file included from lua-recursor4.cc:26:
In file included from ./syncres.hh:42:
In file included from ./recpacketcache.hh:41:
In file included from ./rec-protobuf.hh:24:
In file included from ./protobuf.hh:34:
In file included from /usr/local/include/boost/uuid/uuid_generators.hpp:17:
In file included from /usr/local/include/boost/uuid/random_generator.hpp:19:
In file included from /usr/local/include/boost/tti/has_member_function.hpp:15:
In file included from /usr/local/include/boost/tti/detail/dmem_fun.hpp:11:
In file included from
/usr/local/include/boost/function_types/is_member_function_pointer.hpp:14:
In file included from /usr/local/include/boost/function_types/components.hpp:61:
/usr/local/include/boost/function_types/detail/class_transform.hpp:26:31: error:
expected a qualified name after 'typename'
template<typename T, typename L>
                              ^
./recursor_cache.hh:45:11: note: expanded from macro 'L'
 #define L theL()
           ^

PR:		227427
Reported by:	antoine (via exp-run)
Obtained from:	upstream
[ 07:57 jbeich ] Original commit 
aqsis 1.8.2_17 graphics files touched by this commit Photorealistic rendering system
graphics/aqsis: unbreak with boost 1.67

/usr/bin/ld: undefined reference to symbol `pthread_condattr_init@@FBSD_1.0'
(try adding -lthr)

PR:		227427
Reported by:	antoine (via exp-run)
Regressed by:	https://github.com/boostorg/thread/commit/1e84b978b2bb
[ 07:57 jbeich ] Original commit 
freecad 0.17.12018_2 cad files touched by this commit General purpose 3D CAD modeller
cad/freecad: unbreak with boost 1.67

CMakeFiles/SMESH.dir/src/SMESH/SMESH_Mesh.cpp.o: In function
`boost::condition_variable::condition_variable()':
src/3rdParty/salomesmesh/src/SMESH/SMESH_Mesh.cpp:(.text._ZN5boost18condition_variableC2Ev[_ZN5boost18condition_variableC2Ev]+0x33):
undefined reference to `pthread_condattr_init'
src/3rdParty/salomesmesh/src/SMESH/SMESH_Mesh.cpp:(.text._ZN5boost18condition_variableC2Ev[_ZN5boost18condition_variableC2Ev]+0x4a):
undefined reference to `pthread_condattr_setclock'
src/3rdParty/salomesmesh/src/SMESH/SMESH_Mesh.cpp:(.text._ZN5boost18condition_variableC2Ev[_ZN5boost18condition_variableC2Ev]+0x5f):
undefined reference to `pthread_condattr_destroy'

PR:		227427
Reported by:	antoine (via exp-run)
[ 07:57 jbeich ] Original commit 
opendungeons 0.7.1 games files touched by this commit Open source game inspired by Dungeon Keeper
games/opendungeons: unbreak with boost 1.67

/usr/bin/ld: undefined reference to symbol `pthread_condattr_init@@FBSD_1.0'
(try adding -lthr)

PR:		227427
Reported by:	antoine (via exp-run)
[ 07:57 jbeich ] Original commit 
usbtop 0.2_1 sysutils files touched by this commit Utility that shows an estimated instantaneous USB bandwidth
sysutils/usbtop: unbreak with boost 1.67

/usr/bin/ld: undefined reference to symbol `pthread_condattr_init@@FBSD_1.0'
(try adding -lthr)

PR:		227427
Reported by:	antoine (via exp-run)
[ 03:19 jbeich ] Original commit 
gigalomania 0.28 games new! files touched by this commit Open source 2D real time strategy god game
keeperrl 0.0.23_1 games new! files touched by this commit Ambitious dungeon builder with roguelike elements
linux-dwarffortress 0.44.05 games new! files touched by this commit Dwarven fortress building game with ASCII graphics (Linux version)
opendungeons 0.7.1 games new! files touched by this commit Open source game inspired by Dungeon Keeper
quackle 1.0.3_2 games new! files touched by this commit Scrabble-like word game utilizing Qt4
MFH: r467554

games@ is not to be used as a maintainer per r371872

Pointy hat to:	rene
Approved by:	ports-secteam blanket
[ 03:15 jbeich ] Original commit 
gigalomania 0.28 games files touched by this commit Open source 2D real time strategy god game
keeperrl 0.0.23_1 games files touched by this commit Ambitious dungeon builder with roguelike elements
linux-dwarffortress 0.44.05 games files touched by this commit Dwarven fortress building game with ASCII graphics (Linux version)
opendungeons 0.7.1 games files touched by this commit Open source game inspired by Dungeon Keeper
quackle 1.0.3_2 games files touched by this commit Scrabble-like word game utilizing Qt4
games@ is not to be used as a maintainer per r371872

Pointy hat to:	rene
[ 01:39 jbeich ] Original commit 
firefox 59.0.2_6,1 www files touched by this commit Web browser based on the browser portion of Mozilla
MFH: r467551

www/firefox: crashfix if no clipboard is available

Obtained from:	upstream (Firefox 60)
Approved by:	ports-secteam blanket
[ 01:32 jbeich ] Original commit 
firefox 59.0.2_6,1 www files touched by this commit Web browser based on the browser portion of Mozilla
www/firefox: crashfix if no clipboard is available

Obtained from:	      upstream (Firefox 60)
[ 00:47 jbeich ] Original commit 
citra s20180416 emulators files touched by this commit Nintendo 3DS emulator/debugger
MFH: r467547

emulators/citra: update to s20180416

Changes:	https://github.com/citra-emu/citra/compare/7f408eef...cb36f9fa
Approved by:	ports-secteam (swills, implicit for snapshots)
[ 00:46 jbeich ] Original commit 
rpcs3 0.0.5.196 emulators files touched by this commit PS3 emulator/debugger
MFH: r467546

emulators/rpcs3: update to 0.0.5.196

- Drop "virtual" per https://github.com/RPCS3/rpcs3/commit/c2ae7ee4024e

Changes:	https://github.com/RPCS3/rpcs3/compare/ea82b732a...6baf67520
Approved by:	ports-secteam (junovitch, implicit for snapshots)
[ 00:45 jbeich ] Original commit 
waterfox 56.1.0_11 www  Deprecated Expiration Date files touched by this commit Distilled fork of Firefox
MFH: r467545

www/waterfox: apply some FF60 fixes

Approved by:	ports-secteam blanket
[ 00:44 jbeich ] Original commit 
citra s20180416 emulators files touched by this commit Nintendo 3DS emulator/debugger
emulators/citra: update to s20180416

Changes:	https://github.com/citra-emu/citra/compare/7f408eef...cb36f9fa
[ 00:43 jbeich ] Original commit 
rpcs3 0.0.5.196 emulators files touched by this commit PS3 emulator/debugger
emulators/rpcs3: update to 0.0.5.196

- Drop "virtual" per https://github.com/RPCS3/rpcs3/commit/c2ae7ee4024e

Changes:	https://github.com/RPCS3/rpcs3/compare/ea82b732a...6baf67520
[ 00:43 jbeich ] Original commit 
waterfox 56.1.0_11 www  Deprecated Expiration Date files touched by this commit Distilled fork of Firefox
www/waterfox: apply some FF60 fixes
Mon, 16 Apr 2018
[ 00:51 jbeich ] Original commit 
freeimage 3.16.0_4 graphics new! files touched by this commit Simple C/C++ bitmap graphics library
MFH: r467449

graphics/freeimage: unbreak consumers on arm* with NEON

$ echo 'int main() {}' | cc -xc - -o /dev/null -L/usr/local/lib -lfreeimage -lm
/usr/local/lib/libfreeimage.so: undefined reference to
`png_init_filter_functions_neon'
cc: error: linker command failed with exit code 1 (use -v to see invocation)

Approved by:	ports-secteam blanket
[ 00:37 jbeich ] Original commit 
freeimage 3.16.0_5 graphics files touched by this commit Simple C/C++ bitmap graphics library
graphics/freeimage: unbreak consumers on arm* with NEON

$ echo 'int main() {}' | cc -xc - -o /dev/null -L/usr/local/lib -lfreeimage -lm
/usr/local/lib/libfreeimage.so: undefined reference to
`png_init_filter_functions_neon'
cc: error: linker command failed with exit code 1 (use -v to see invocation)
Sun, 15 Apr 2018
[ 23:58 jbeich ] Original commit 
freeimage 3.16.0_3 graphics new! files touched by this commit Simple C/C++ bitmap graphics library
MFH: r467442

graphics/freeimage: unbreak build with Clang 6 (C++14 by default)

Source/LibRawLite/./internal/dcraw_common.cpp:2042:17: error: constant
expression evaluates to -2 which cannot be narrowed to type 'char'
[-Wc++11-narrowing]
    1,0, 2,2, 2,-2,
                ^~
Source/LibRawLite/./internal/dcraw_common.cpp:2042:17: note: insert an explicit
cast to silence this issue
    1,0, 2,2, 2,-2,
                ^~
                static_cast<char>( )
[...]

Reported by:	pkg-fallout (armv6, armv7, aarch64)
Approved by:	ports-secteam blanket
[ 23:58 jbeich ] Original commit 
ceres-solver 1.14.0 math new! files touched by this commit Nonlinear least squares minimizer
MFH: r467441

math/ceres-solver: unbreak OPENMP=off after r465555

$ make config
| |---------------------------- Threading support ---------------------------| |
| |+( ) OPENMP       Parallel processing support via OpenMP                  | |
| |+(*) TBB          Intel threading building blocks                         | |
====> You cannot select multiple options from the THREADS radio
=====> Only one of these must be defined: OPENMP TBB
Config is invalid. Re-edit? [Y/n] y

Approved by:	ports-secteam blanket
[ 23:57 jbeich ] Original commit 
freeimage 3.16.0_4 graphics files touched by this commit Simple C/C++ bitmap graphics library
graphics/freeimage: unbreak on armv7

/usr/bin/ld: ./Source/FreeImage/BitmapAccess.o(.text+0x2d0): unresolvable
R_ARM_MOVW_ABS_NC relocation against symbol `_ZSt7nothrow'
/usr/bin/ld: final link failed: Nonrepresentable section on output
cc: error: linker command failed with exit code 1 (use -v to see invocation)
[ 23:57 jbeich ] Original commit 
freeimage 3.16.0_4 graphics files touched by this commit Simple C/C++ bitmap graphics library
graphics/freeimage: unbreak build with Clang 6 (C++14 by default)

Source/LibRawLite/./internal/dcraw_common.cpp:2042:17: error: constant
expression evaluates to -2 which cannot be narrowed to type 'char'
[-Wc++11-narrowing]
    1,0, 2,2, 2,-2,
                ^~
Source/LibRawLite/./internal/dcraw_common.cpp:2042:17: note: insert an explicit
cast to silence this issue
    1,0, 2,2, 2,-2,
                ^~
                static_cast<char>( )
[...]

Reported by:	pkg-fallout (armv6, armv7, aarch64)
[ 23:57 jbeich ] Original commit 
ceres-solver 1.14.0 math files touched by this commit Nonlinear least squares minimizer
math/ceres-solver: unbreak OPENMP=off after r465555

$ make config
| |---------------------------- Threading support ---------------------------| |
| |+( ) OPENMP       Parallel processing support via OpenMP                  | |
| |+(*) TBB          Intel threading building blocks                         | |
====> You cannot select multiple options from the THREADS radio
=====> Only one of these must be defined: OPENMP TBB
Config is invalid. Re-edit? [Y/n] y
[ 23:57 jbeich ] Original commit 
tbb 2018.2 devel files touched by this commit Library that provides thread building blocks
devel/tbb: enable on armv7
[ 04:56 jbeich ] Original commit 
icinga2 2.8.2 net-mgmt files touched by this commit Monitoring and management system for hosts, services and networks
net-mgmt/icinga2: unbreak with boost 1.67

In file included from lib/base/base_unity.cpp:61:
lib/base/timer.cpp:269:31: error: no matching conversion for functional-style
cast from 'double' to 'boost::posix_time::milliseconds' (aka
'subsecond_duration<boost::posix_time::time_duration, 1000>')
                        l_TimerCV.timed_wait(lock,
boost::posix_time::milliseconds(wait * 1000));
                                                  
^~~~~~~~~~~~~~~~~~~~~~~~~~~~~~~~~~~~~~~~~~~

PR:		227427
Reported by:	antoine (via exp-run)
[ 04:55 jbeich ] Original commit 
uhd 3.10.3.0_3 comms files touched by this commit Ettus Research UHD driver framework
comms/uhd: unbreak with boost 1.67

host/lib/usrp/cores/rx_vita_core_3000.cpp:77:35: error:
      no matching conversion for functional-style cast from 'double' to
'boost::posix_time::milliseconds' (aka
      'subsecond_duration<boost::posix_time::time_duration, 1000>')
        boost::this_thread::sleep(boost::posix_time::milliseconds(1.0));
                                  ^~~~~~~~~~~~~~~~~~~~~~~~~~~~~~~~~~~
PR:		227427
Reported by:	antoine (via exp-run)
[ 00:41 jbeich ] Original commit 
py-exiv2 0.3.2_11 graphics files touched by this commit Python bindings for exiv2
graphics/py-exiv2: unbreak with boost 1.67

c++ -o build/libexiv2python.so -fstack-protector -shared build/exiv2wrapper.os
build/exiv2wrapper_python.os -L/usr/local/lib -lboost_python -lexiv2
/usr/bin/ld: cannot find -lboost_python

PR:		227427
Reported by:	antoine (via exp-run)
Sat, 14 Apr 2018
[ 09:07 jbeich ] Original commit 
pulseaudio 11.1 audio files touched by this commit Sound server for UNIX
MFH: r467282

audio/pulseaudio: update to 11.1

Changes:	https://github.com/pulseaudio/pulseaudio/compare/v11.0...v11.1
ABI:		https://abi-laboratory.pro/tracker/timeline/pulseaudio/
PR:		223506
Submitted by:	lightside <lightside@gmx.com>
Approved by:	maintainer timeout (5 months)
Approved by:	ports-secteam (delphij)
[ 02:05 jbeich ] Original commit 
pulseaudio 11.1 audio files touched by this commit Sound server for UNIX
audio/pulseaudio: update to 11.1

Changes:	https://github.com/pulseaudio/pulseaudio/compare/v11.0...v11.1
ABI:		https://abi-laboratory.pro/tracker/timeline/pulseaudio/
PR:		223506
Submitted by:	lightside <lightside@gmx.com>
Approved by:	maintainer timeout (5 months)
MFH:		2018Q2 (regression fixes)
[ 00:57 jbeich ] Original commit 
py-libusb115 1.5.3 devel  Deleted files touched by this commit Pure-python wrapper for libusb-1.0
devel/py-libusb115: drop due to lack of consumers
[ 00:57 jbeich ] Original commit 
py-adb 1.2.0.24 devel files touched by this commit Pure-python implementation of ADB and Fastboot protocols
devel/py-adb: update to 1.2.0.24 (snapshot)

- Switch to py-libusb1
- Expose Python 3.x support
- Hook up tests

Changes:	https://github.com/google/python-adb/compare/fb09de9...ff48509
[ 00:17 jbeich ] Original commit 
vapoursynth-l-smash-works 0.0.935 multimedia files touched by this commit L-SMASH source plugin for VapourSynth
multimedia/vapoursynth-l-smash-works: update to 0.0.935

Changes:	https://github.com/VFR-maniac/L-SMASH-Works/compare/fba174b...3edd194
Fri, 13 Apr 2018
[ 23:26 jbeich ] Original commit 
openbor 4942 games files touched by this commit Moddable fighting game engine (aka Beats of Rage)
MFH: r466272 r467277

games/openbor: update to 4942

Changes:	https://github.com/DCurrent/openbor/compare/57735a1...449e528
Approved by:	ports-secteam (feld, implicit for snapshots)
[ 23:19 jbeich ] Original commit 
openbor 4942 games files touched by this commit Moddable fighting game engine (aka Beats of Rage)
games/openbor: update to 4942

Changes:	https://github.com/DCurrent/openbor/compare/62edc19...449e528
[ 22:09 jbeich ] Original commit 
citra s20180413 emulators files touched by this commit Nintendo 3DS emulator/debugger
MFH: r467274

emulators/citra: update to s20180413

Changes:	https://github.com/citra-emu/citra/compare/8b858f1b...7f408eef
Approved by:	ports-secteam (swills, implicit for snapshots)
[ 22:09 jbeich ] Original commit 
waterfox 56.1.0_10 www  Deprecated Expiration Date files touched by this commit Distilled fork of Firefox
MFH: r467273

www/waterfox: apply some FF60 fixes

Approved by:	ports-secteam blanket
[ 22:07 jbeich ] Original commit 
citra s20180413 emulators files touched by this commit Nintendo 3DS emulator/debugger
emulators/citra: update to s20180413

Changes:	https://github.com/citra-emu/citra/compare/8b858f1b...7f408eef
[ 22:07 jbeich ] Original commit 
waterfox 56.1.0_10 www  Deprecated Expiration Date files touched by this commit Distilled fork of Firefox
www/waterfox: apply some FF60 fixes
[ 20:57 jbeich ] Original commit 
py-flexget 2.13.11_1,1 www files touched by this commit Program to automate downloading from different sources
www/py-flexget: update to 2.13.11

Changes:	https://github.com/Flexget/Flexget/compare/2.13.9...2.13.11
[ 20:56 jbeich ] Original commit 
py-zxcvbn 4.4.25 security files touched by this commit Realistic password strength estimator
py-zxcvbn-python 4.4.23 security  Deleted files touched by this commit Realistic password strength estimator
py-flexget 2.13.9_1,1 www files touched by this commit Program to automate downloading from different sources
security/py-zxcvbn-python: update to 4.4.25 and rename

Changes:	https://github.com/dwolfhub/zxcvbn-python/compare/v4.4.23...v4.4.25
[ 13:05 jbeich ] Original commit 
libtorrent-rasterbar 1.1.6 net-p2p files touched by this commit C++ library implementing a BitTorrent client
net-p2p/libtorrent-rasterbar: unbreak with boost 1.67

In file included from disk_buffer_holder.cpp:34:
In file included from ../include/libtorrent/aux_/session_impl.hpp:73:
../include/libtorrent/ip_filter.hpp:168:34: error: no member named 'prior' in
namespace 'boost'; did you mean
      'perror'?
                        boost::uint32_t last_access = boost::prior(j)->access;
                                                      ^~~~~~~~~~~~
                                                      perror
/usr/include/stdio.h:266:7: note: 'perror' declared here
void     perror(const char *);
         ^
In file included from disk_buffer_holder.cpp:34:
In file included from ../include/libtorrent/aux_/session_impl.hpp:73:
../include/libtorrent/ip_filter.hpp:174:43: error: no member named 'prior' in
namespace 'boost'; did you mean
(Only the first 15 lines of the commit message are shown above View all of this commit message)
Thu, 12 Apr 2018
[ 00:20 jbeich ] Original commit 
py-flexget 2.13.9,1 www files touched by this commit Program to automate downloading from different sources
www/py-flexget: update to 2.13.9

- Chase upstream by switching to SQLAlchemy 1.2.6

Changes:	https://github.com/Flexget/Flexget/compare/2.13.7...2.13.9
Number of commits: 3349 (showing only 100 on this page) 1 | 2 | 3 | 4 | 5 | 6 | 7 | 8 | 9 | 10 | 11  »  [34]
Login
User Login
Create account

Servers and bandwidth provided by
New York Internet, SuperNews, and RootBSD

This site
What is FreshPorts?
About the authors
Issues
FAQ
How big is it?
The latest upgrade!
Privacy
Forums
Blog
Contact

Search
Enter Keywords:
 
more...

Latest Vulnerabilities
mbedtlsApr 23
polarssl13Apr 23
mariadb100-serverApr 21
mariadb101-serverApr 21
mariadb102-serverApr 21
mariadb55-serverApr 21
mysql55-serverApr 21
mysql56-serverApr 21
mysql57-serverApr 21
percona55-serverApr 21
percona56-serverApr 21
percona57-serverApr 21
wordpressApr 20
wordpressApr 20
wordpressApr 20

13 vulnerabilities affecting 122 ports have been reported in the past 14 days

* - modified, not new

All vulnerabilities

Last updated:
2018-04-23 20:20:00


Ports
Home
Categories
Deleted ports
Sanity Test Failures
Newsfeeds

Statistics
Graphs
NEW Graphs (Javascript)
Traffic

Calculated hourly:
Port count 33822
Broken 102
Deprecated 60
Ignore 331
Forbidden 3
Restricted 169
No CDROM 77
Vulnerable 37
Expired 8
Set to expire 49
Interactive 0
new 24 hours 11
new 48 hours25
new 7 days65
new fortnight8043
new month8673

Servers and bandwidth provided by
New York Internet, SuperNews, and RootBSD
Valid HTML, CSS, and RSS.
Copyright © 2000-2018 Dan Langille. All rights reserved.